{"text_format":"1","workbook":"xlsx","n_sheets":8,"sheets":["Leader Board","Round 1","Round 2","Round 3","Round 4","Round 5","Round 6","SumSheet"],"not_rendered":{"charts":0,"images":0,"macros":1,"external_links":0,"defined_names":269,"comments":0,"pivot_tables":0},"unopened":[],"bounds":{"document_bytes":16777216,"sheet_cells":100000,"rows_first":2000,"rows_last":500,"rows_between":2000,"halvings":0,"cell_chars":16384,"cell_head_chars":4096},"cells_cut":0,"cells_raw":0,"read":"whole","date_system":"1900"}

{"sheet":"Leader Board","index":0,"n_rows":36,"n_cols":49,"rows_kept":36,"cut":false,"hidden":false,"merged":[[4,48,4,55],[4,1,4,9],[4,11,4,18],[4,20,4,27],[4,29,4,37],[4,39,4,46]]}
[]
[]
[]
[null,null,null,null,null,null,null,null,null,null,null,null,null,null,null,null,null,null,null,null,null,null,null,null,null,null,null,null,null,"Used to reformat the leader board after resorting the results. DO NOT MODIFY",null,null,null,null,null,null,null,null,null,"Used to reformat the Group A leader boards after resorting the results. DO NOT MODIFY",null,null,null,null,null,null,null,null,"Used to reformat the Group B leader board after resorting the results. DO NOT MODIFY"]
[null,{"$f":" SeriesName & \" - Round \" & RoundsRun & \" of 6  (Overall)\"","v":"2017 Group C / IMSA - Round 3 of 6  (Overall)"},null,null,null,null,null,null,null,null,null,{"$f":" SeriesName & \" - Round \" & RoundsRun & \" of 6 (Group A)\"","v":"2017 Group C / IMSA - Round 3 of 6 (Group A)"},null,null,null,null,null,null,null,null,{"$f":" SeriesName & \" - Round \" & RoundsRun & \" of 6 (Group B)\"","v":"2017 Group C / IMSA - Round 3 of 6 (Group B)"}]
[null,"Position","+/-","Driver","Grp","Points","Behind","Starts","Laps","Fastest Laps",null,"Position","+/-","Driver","Points","Behind","Starts","Laps","Fastest Laps",null,"Position","+/-","Driver","Points","Behind","Starts","Laps","Fastest Laps"]
[null,{"$f":"IF(ISNA(VLOOKUP($D7,SeriesSummary,Rank,FALSE)),\"\",VLOOKUP($D7,SeriesSummary,Rank,FALSE))","v":1},{"$f":"IF(ISNA(VLOOKUP($D7,SeriesSummary,ChangeInRank,FALSE)),\"\",VLOOKUP($D7,SeriesSummary,ChangeInRank,FALSE))","v":"-"},{"$f":"IF(SumSheet!BM10>0,SumSheet!B10,\"\")","v":"Ary B."},{"$f":"IF(SumSheet!BM10>0,SumSheet!C10,\"\")","v":"A"},{"$f":"IF(D7<>\"\",IF(ISNA(VLOOKUP($D7,SeriesSummary,TotalPoints,FALSE)),\"-\",VLOOKUP($D7,SeriesSummary,TotalPoints,FALSE)),\"\")","v":61},"Leader",{"$f":"IF(ISNA(VLOOKUP($D7,SeriesSummary,Starts,FALSE)),\"\",VLOOKUP($D7,SeriesSummary,Starts,FALSE))","v":3},{"$f":"IF(ISNA(VLOOKUP($D7,SeriesSummary,TotalLaps,FALSE)),\"\",VLOOKUP($D7,SeriesSummary,TotalLaps,FALSE))","v":672.42000000000007},{"$f":"IF(ISNA(VLOOKUP($D7,SeriesSummary,FastestLaps,FALSE)),\"\",VLOOKUP($D7,SeriesSummary,FastestLaps,FALSE))","v":2},null,{"$f":"IF(ISNA(VLOOKUP($N7,SeriesSummary,ClassRank,FALSE)),\"\",VLOOKUP($N7,SeriesSummary,ClassRank,FALSE))","v":1},{"$f":"IF(ISNA(VLOOKUP($N7,SeriesSummary,ChangeInClassRank,FALSE)),\"\",VLOOKUP($N7,SeriesSummary,ChangeInClassRank,FALSE))","v":"-"},{"$f":"IF(AND(SumSheet!BM10>0,SumSheet!C10=\"A\"),SumSheet!B10,\"\")","v":"Ary B."},{"$f":"IF(N7<>\"\",IF(ISNA(VLOOKUP($N7,SeriesSummary,TotalPoints,FALSE)),\"-\",VLOOKUP($N7,SeriesSummary,TotalPoints,FALSE)),\"\")","v":61},"Leader",{"$f":"IF(ISNA(VLOOKUP($N7,SeriesSummary,Starts,FALSE)),\"\",VLOOKUP($N7,SeriesSummary,Starts,FALSE))","v":3},{"$f":"IF(ISNA(VLOOKUP($N7,SeriesSummary,TotalLaps,FALSE)),\"\",VLOOKUP($N7,SeriesSummary,TotalLaps,FALSE))","v":672.42000000000007},{"$f":"IF(ISNA(VLOOKUP($N7,SeriesSummary,FastestLaps,FALSE)),\"\",VLOOKUP($N7,SeriesSummary,FastestLaps,FALSE))","v":2},null,{"$f":"IF(ISNA(VLOOKUP($W7,SeriesSummary,ClassRank,FALSE)),\"\",VLOOKUP($W7,SeriesSummary,ClassRank,FALSE))","v":1},{"$f":"IF(ISNA(VLOOKUP($W7,SeriesSummary,ChangeInClassRank,FALSE)),\"\",VLOOKUP($W7,SeriesSummary,ChangeInClassRank,FALSE))","v":"-"},{"$f":"IF(AND(SumSheet!BM25>0,SumSheet!C25=\"B\"),SumSheet!B25,\"\")","v":"Rich C."},{"$f":"IF(W7<>\"\",IF(ISNA(VLOOKUP($W7,SeriesSummary,TotalPoints,FALSE)),\"-\",VLOOKUP($W7,SeriesSummary,TotalPoints,FALSE)),\"\")","v":47},"Leader",{"$f":"IF(ISNA(VLOOKUP($W7,SeriesSummary,Starts,FALSE)),\"\",VLOOKUP($W7,SeriesSummary,Starts,FALSE))","v":3},{"$f":"IF(ISNA(VLOOKUP($W7,SeriesSummary,TotalLaps,FALSE)),\"\",VLOOKUP($W7,SeriesSummary,TotalLaps,FALSE))","v":629.5},{"$f":"IF(ISNA(VLOOKUP($W7,SeriesSummary,FastestLaps,FALSE)),\"\",VLOOKUP($W7,SeriesSummary,FastestLaps,FALSE))","v":3}]
[null,{"$f":"IF(ISNA(VLOOKUP($D8,SeriesSummary,Rank,FALSE)),\"\",VLOOKUP($D8,SeriesSummary,Rank,FALSE))","v":2},{"$f":"IF(ISNA(VLOOKUP($D8,SeriesSummary,ChangeInRank,FALSE)),\"\",VLOOKUP($D8,SeriesSummary,ChangeInRank,FALSE))","v":"-"},{"$f":"IF(SumSheet!BM20>0,SumSheet!B20,\"\")","v":"Marty M."},{"$f":"IF(SumSheet!BM20>0,SumSheet!C20,\"\")","v":"A"},57,{"$f":"IF(ISERROR(F8-$F$7),\"\",F8-$F$7)","v":-4},3,666.93000000000006,0,null,{"$f":"IF(ISNA(VLOOKUP($N8,SeriesSummary,ClassRank,FALSE)),\"\",VLOOKUP($N8,SeriesSummary,ClassRank,FALSE))","v":2},{"$f":"IF(ISNA(VLOOKUP($N8,SeriesSummary,ChangeInClassRank,FALSE)),\"\",VLOOKUP($N8,SeriesSummary,ChangeInClassRank,FALSE))","v":"-"},{"$f":"IF(AND(SumSheet!BM20>0,SumSheet!C20=\"A\"),SumSheet!B20,\"\")","v":"Marty M."},57,{"$f":"IF(ISERROR(O8-$O$7),\"\",O8-$O$7)","v":-4},3,666.93000000000006,0,null,{"$f":"IF(ISNA(VLOOKUP($W8,SeriesSummary,ClassRank,FALSE)),\"\",VLOOKUP($W8,SeriesSummary,ClassRank,FALSE))","v":2},{"$f":"IF(ISNA(VLOOKUP($W8,SeriesSummary,ChangeInClassRank,FALSE)),\"\",VLOOKUP($W8,SeriesSummary,ChangeInClassRank,FALSE))","v":"-"},{"$f":"IF(AND(SumSheet!BM19>0,SumSheet!C19=\"B\"),SumSheet!B19,\"\")","v":"Mark L."},29,{"$f":"IF(ISERROR(X8-$X$7),\"\",X8-$X$7)","v":-18},3,605.67000000000007,0]
[null,{"$f":"IF(ISNA(VLOOKUP($D9,SeriesSummary,Rank,FALSE)),\"\",VLOOKUP($D9,SeriesSummary,Rank,FALSE))","v":3},{"$f":"IF(ISNA(VLOOKUP($D9,SeriesSummary,ChangeInRank,FALSE)),\"\",VLOOKUP($D9,SeriesSummary,ChangeInRank,FALSE))","v":"-"},{"$f":"IF(SumSheet!BM17>0,SumSheet!B17,\"\")","v":"Jordan C."},{"$f":"IF(SumSheet!BM17>0,SumSheet!C17,\"\")","v":"A"},{"$f":"IF(D9<>\"\",IF(ISNA(VLOOKUP($D9,SeriesSummary,TotalPoints,FALSE)),\"-\",VLOOKUP($D9,SeriesSummary,TotalPoints,FALSE)),\"\")","v":50},{"$f":"IF(ISERROR(F9-$F$7),\"\",F9-$F$7)","v":-11},3,642.16,0,null,{"$f":"IF(ISNA(VLOOKUP($N9,SeriesSummary,ClassRank,FALSE)),\"\",VLOOKUP($N9,SeriesSummary,ClassRank,FALSE))","v":3},{"$f":"IF(ISNA(VLOOKUP($N9,SeriesSummary,ChangeInClassRank,FALSE)),\"\",VLOOKUP($N9,SeriesSummary,ChangeInClassRank,FALSE))","v":"-"},{"$f":"IF(AND(SumSheet!BM17>0,SumSheet!C17=\"A\"),SumSheet!B17,\"\")","v":"Jordan C."},{"$f":"IF(N9<>\"\",IF(ISNA(VLOOKUP($N9,SeriesSummary,TotalPoints,FALSE)),\"-\",VLOOKUP($N9,SeriesSummary,TotalPoints,FALSE)),\"\")","v":50},{"$f":"IF(ISERROR(O9-$O$7),\"\",O9-$O$7)","v":-11},3,642.16,0,null,{"$f":"IF(ISNA(VLOOKUP($W9,SeriesSummary,ClassRank,FALSE)),\"\",VLOOKUP($W9,SeriesSummary,ClassRank,FALSE))","v":3},{"$f":"IF(ISNA(VLOOKUP($W9,SeriesSummary,ChangeInClassRank,FALSE)),\"\",VLOOKUP($W9,SeriesSummary,ChangeInClassRank,FALSE))","v":"+1"},{"$f":"IF(AND(SumSheet!BM13>0,SumSheet!C13=\"B\"),SumSheet!B13,\"\")","v":"Brett L."},{"$f":"IF(W9<>\"\",IF(ISNA(VLOOKUP($W9,SeriesSummary,TotalPoints,FALSE)),\"-\",VLOOKUP($W9,SeriesSummary,TotalPoints,FALSE)),\"\")","v":29},{"$f":"IF(ISERROR(X9-$X$7),\"\",X9-$X$7)","v":-18},3,598.36,0]
[null,{"$f":"IF(ISNA(VLOOKUP($D10,SeriesSummary,Rank,FALSE)),\"\",VLOOKUP($D10,SeriesSummary,Rank,FALSE))","v":4},{"$f":"IF(ISNA(VLOOKUP($D10,SeriesSummary,ChangeInRank,FALSE)),\"\",VLOOKUP($D10,SeriesSummary,ChangeInRank,FALSE))","v":"+3"},{"$f":"IF(SumSheet!BM15>0,SumSheet!B15,\"\")","v":"David C."},{"$f":"IF(SumSheet!BM15>0,SumSheet!C15,\"\")","v":"A"},49,-12,3,644.27,1,null,{"$f":"IF(ISNA(VLOOKUP($N10,SeriesSummary,ClassRank,FALSE)),\"\",VLOOKUP($N10,SeriesSummary,ClassRank,FALSE))","v":4},{"$f":"IF(ISNA(VLOOKUP($N10,SeriesSummary,ChangeInClassRank,FALSE)),\"\",VLOOKUP($N10,SeriesSummary,ChangeInClassRank,FALSE))","v":"+2"},{"$f":"IF(AND(SumSheet!BM15>0,SumSheet!C15=\"A\"),SumSheet!B15,\"\")","v":"David C."},49,-12,3,644.27,1,null,{"$f":"IF(ISNA(VLOOKUP($W10,SeriesSummary,ClassRank,FALSE)),\"\",VLOOKUP($W10,SeriesSummary,ClassRank,FALSE))","v":4},{"$f":"IF(ISNA(VLOOKUP($W10,SeriesSummary,ChangeInClassRank,FALSE)),\"\",VLOOKUP($W10,SeriesSummary,ChangeInClassRank,FALSE))","v":-1},{"$f":"IF(AND(SumSheet!BM24>0,SumSheet!C24=\"B\"),SumSheet!B24,\"\")","v":"Randy A."},25,-22,3,600.95000000000005,0]
[null,{"$f":"IF(ISNA(VLOOKUP($D11,SeriesSummary,Rank,FALSE)),\"\",VLOOKUP($D11,SeriesSummary,Rank,FALSE))","v":5},{"$f":"IF(ISNA(VLOOKUP($D11,SeriesSummary,ChangeInRank,FALSE)),\"\",VLOOKUP($D11,SeriesSummary,ChangeInRank,FALSE))","v":"-"},{"$f":"IF(SumSheet!BM25>0,SumSheet!B25,\"\")","v":"Rich C."},{"$f":"IF(SumSheet!BM25>0,SumSheet!C25,\"\")","v":"B"},47,-14,3,629.5,3,null,{"$f":"IF(ISNA(VLOOKUP($N11,SeriesSummary,ClassRank,FALSE)),\"\",VLOOKUP($N11,SeriesSummary,ClassRank,FALSE))","v":5},{"$f":"IF(ISNA(VLOOKUP($N11,SeriesSummary,ChangeInClassRank,FALSE)),\"\",VLOOKUP($N11,SeriesSummary,ChangeInClassRank,FALSE))","v":-1},{"$f":"IF(AND(SumSheet!BM9>0,SumSheet!C9=\"A\"),SumSheet!B9,\"\")","v":"Alejandro G."},46,-15,3,634.67000000000007,0,null,{"$f":"IF(ISNA(VLOOKUP($W11,SeriesSummary,ClassRank,FALSE)),\"\",VLOOKUP($W11,SeriesSummary,ClassRank,FALSE))","v":5},{"$f":"IF(ISNA(VLOOKUP($W11,SeriesSummary,ChangeInClassRank,FALSE)),\"\",VLOOKUP($W11,SeriesSummary,ChangeInClassRank,FALSE))","v":"-"},{"$f":"IF(AND(SumSheet!BM16>0,SumSheet!C16=\"B\"),SumSheet!B16,\"\")","v":"John B."},18,-29,2,402.04,0]
[null,{"$f":"IF(ISNA(VLOOKUP($D12,SeriesSummary,Rank,FALSE)),\"\",VLOOKUP($D12,SeriesSummary,Rank,FALSE))","v":6},{"$f":"IF(ISNA(VLOOKUP($D12,SeriesSummary,ChangeInRank,FALSE)),\"\",VLOOKUP($D12,SeriesSummary,ChangeInRank,FALSE))","v":-2},{"$f":"IF(SumSheet!BM9>0,SumSheet!B9,\"\")","v":"Alejandro G."},{"$f":"IF(SumSheet!BM9>0,SumSheet!C9,\"\")","v":"A"},46,-15,3,634.67000000000007,0,null,{"$f":"IF(ISNA(VLOOKUP($N12,SeriesSummary,ClassRank,FALSE)),\"\",VLOOKUP($N12,SeriesSummary,ClassRank,FALSE))","v":6},{"$f":"IF(ISNA(VLOOKUP($N12,SeriesSummary,ChangeInClassRank,FALSE)),\"\",VLOOKUP($N12,SeriesSummary,ChangeInClassRank,FALSE))","v":"+1"},{"$f":"IF(AND(SumSheet!BM26>0,SumSheet!C26=\"A\"),SumSheet!B26,\"\")","v":"Roy M."},40,-21,3,625.58000000000004,0,null,{"$f":"IF(ISNA(VLOOKUP($W12,SeriesSummary,ClassRank,FALSE)),\"\",VLOOKUP($W12,SeriesSummary,ClassRank,FALSE))","v":6},{"$f":"IF(ISNA(VLOOKUP($W12,SeriesSummary,ChangeInClassRank,FALSE)),\"\",VLOOKUP($W12,SeriesSummary,ChangeInClassRank,FALSE))","v":-1},{"$f":"IF(AND(SumSheet!BM22>0,SumSheet!C22=\"B\"),SumSheet!B22,\"\")","v":"Mitch A."},16,-31,2,292,0]
[null,{"$f":"IF(ISNA(VLOOKUP($D13,SeriesSummary,Rank,FALSE)),\"\",VLOOKUP($D13,SeriesSummary,Rank,FALSE))","v":7},{"$f":"IF(ISNA(VLOOKUP($D13,SeriesSummary,ChangeInRank,FALSE)),\"\",VLOOKUP($D13,SeriesSummary,ChangeInRank,FALSE))","v":"+1"},{"$f":"IF(SumSheet!BM26>0,SumSheet!B26,\"\")","v":"Roy M."},{"$f":"IF(SumSheet!BM26>0,SumSheet!C26,\"\")","v":"A"},40,-21,3,625.58000000000004,0,null,{"$f":"IF(ISNA(VLOOKUP($N13,SeriesSummary,ClassRank,FALSE)),\"\",VLOOKUP($N13,SeriesSummary,ClassRank,FALSE))","v":7},{"$f":"IF(ISNA(VLOOKUP($N13,SeriesSummary,ChangeInClassRank,FALSE)),\"\",VLOOKUP($N13,SeriesSummary,ChangeInClassRank,FALSE))","v":-1},{"$f":"IF(AND(SumSheet!BM29>0,SumSheet!C29=\"A\"),SumSheet!B29,\"\")","v":"Stephen B."},40,-21,3,625.25,0,null,{"$f":"IF(ISNA(VLOOKUP($W13,SeriesSummary,ClassRank,FALSE)),\"\",VLOOKUP($W13,SeriesSummary,ClassRank,FALSE))","v":""},{"$f":"IF(ISNA(VLOOKUP($W13,SeriesSummary,ChangeInClassRank,FALSE)),\"\",VLOOKUP($W13,SeriesSummary,ChangeInClassRank,FALSE))","v":""},{"$f":"IF(AND(SumSheet!BM9>0,SumSheet!C9=\"B\"),SumSheet!B9,\"\")","v":""},"","","","",""]
[null,{"$f":"IF(ISNA(VLOOKUP($D14,SeriesSummary,Rank,FALSE)),\"\",VLOOKUP($D14,SeriesSummary,Rank,FALSE))","v":8},{"$f":"IF(ISNA(VLOOKUP($D14,SeriesSummary,ChangeInRank,FALSE)),\"\",VLOOKUP($D14,SeriesSummary,ChangeInRank,FALSE))","v":-2},{"$f":"IF(SumSheet!BM29>0,SumSheet!B29,\"\")","v":"Stephen B."},{"$f":"IF(SumSheet!BM29>0,SumSheet!C29,\"\")","v":"A"},40,-21,3,625.25,0,null,{"$f":"IF(ISNA(VLOOKUP($N14,SeriesSummary,ClassRank,FALSE)),\"\",VLOOKUP($N14,SeriesSummary,ClassRank,FALSE))","v":8},{"$f":"IF(ISNA(VLOOKUP($N14,SeriesSummary,ChangeInClassRank,FALSE)),\"\",VLOOKUP($N14,SeriesSummary,ChangeInClassRank,FALSE))","v":"-"},{"$f":"IF(AND(SumSheet!BM27>0,SumSheet!C27=\"A\"),SumSheet!B27,\"\")","v":"Russell M."},37,-24,3,621.75,0,null,{"$f":"IF(ISNA(VLOOKUP($W14,SeriesSummary,ClassRank,FALSE)),\"\",VLOOKUP($W14,SeriesSummary,ClassRank,FALSE))","v":""},{"$f":"IF(ISNA(VLOOKUP($W14,SeriesSummary,ChangeInClassRank,FALSE)),\"\",VLOOKUP($W14,SeriesSummary,ChangeInClassRank,FALSE))","v":""},{"$f":"IF(AND(SumSheet!BM10>0,SumSheet!C10=\"B\"),SumSheet!B10,\"\")","v":""},"","","","",""]
[null,{"$f":"IF(ISNA(VLOOKUP($D15,SeriesSummary,Rank,FALSE)),\"\",VLOOKUP($D15,SeriesSummary,Rank,FALSE))","v":9},{"$f":"IF(ISNA(VLOOKUP($D15,SeriesSummary,ChangeInRank,FALSE)),\"\",VLOOKUP($D15,SeriesSummary,ChangeInRank,FALSE))","v":"-"},{"$f":"IF(SumSheet!BM27>0,SumSheet!B27,\"\")","v":"Russell M."},{"$f":"IF(SumSheet!BM27>0,SumSheet!C27,\"\")","v":"A"},37,-24,3,621.75,0,null,{"$f":"IF(ISNA(VLOOKUP($N15,SeriesSummary,ClassRank,FALSE)),\"\",VLOOKUP($N15,SeriesSummary,ClassRank,FALSE))","v":9},{"$f":"IF(ISNA(VLOOKUP($N15,SeriesSummary,ChangeInClassRank,FALSE)),\"\",VLOOKUP($N15,SeriesSummary,ChangeInClassRank,FALSE))","v":"-"},{"$f":"IF(AND(SumSheet!BM28>0,SumSheet!C28=\"A\"),SumSheet!B28,\"\")","v":"Shawn G."},35,-26,3,620.6,0,null,{"$f":"IF(ISNA(VLOOKUP($W15,SeriesSummary,ClassRank,FALSE)),\"\",VLOOKUP($W15,SeriesSummary,ClassRank,FALSE))","v":""},{"$f":"IF(ISNA(VLOOKUP($W15,SeriesSummary,ChangeInClassRank,FALSE)),\"\",VLOOKUP($W15,SeriesSummary,ChangeInClassRank,FALSE))","v":""},{"$f":"IF(AND(SumSheet!BM11>0,SumSheet!C11=\"B\"),SumSheet!B11,\"\")","v":""},"","","","",""]
[null,{"$f":"IF(ISNA(VLOOKUP($D16,SeriesSummary,Rank,FALSE)),\"\",VLOOKUP($D16,SeriesSummary,Rank,FALSE))","v":10},{"$f":"IF(ISNA(VLOOKUP($D16,SeriesSummary,ChangeInRank,FALSE)),\"\",VLOOKUP($D16,SeriesSummary,ChangeInRank,FALSE))","v":"-"},{"$f":"IF(SumSheet!BM28>0,SumSheet!B28,\"\")","v":"Shawn G."},{"$f":"IF(SumSheet!BM28>0,SumSheet!C28,\"\")","v":"A"},35,-26,3,620.6,0,null,{"$f":"IF(ISNA(VLOOKUP($N16,SeriesSummary,ClassRank,FALSE)),\"\",VLOOKUP($N16,SeriesSummary,ClassRank,FALSE))","v":""},{"$f":"IF(ISNA(VLOOKUP($N16,SeriesSummary,ChangeInClassRank,FALSE)),\"\",VLOOKUP($N16,SeriesSummary,ChangeInClassRank,FALSE))","v":""},{"$f":"IF(AND(SumSheet!BM11>0,SumSheet!C11=\"A\"),SumSheet!B11,\"\")","v":""},"","","","","",null,{"$f":"IF(ISNA(VLOOKUP($W16,SeriesSummary,ClassRank,FALSE)),\"\",VLOOKUP($W16,SeriesSummary,ClassRank,FALSE))","v":""},{"$f":"IF(ISNA(VLOOKUP($W16,SeriesSummary,ChangeInClassRank,FALSE)),\"\",VLOOKUP($W16,SeriesSummary,ChangeInClassRank,FALSE))","v":""},{"$f":"IF(AND(SumSheet!BM12>0,SumSheet!C12=\"B\"),SumSheet!B12,\"\")","v":""},"","","","",""]
[null,{"$f":"IF(ISNA(VLOOKUP($D17,SeriesSummary,Rank,FALSE)),\"\",VLOOKUP($D17,SeriesSummary,Rank,FALSE))","v":11},{"$f":"IF(ISNA(VLOOKUP($D17,SeriesSummary,ChangeInRank,FALSE)),\"\",VLOOKUP($D17,SeriesSummary,ChangeInRank,FALSE))","v":"-"},{"$f":"IF(SumSheet!BM19>0,SumSheet!B19,\"\")","v":"Mark L."},{"$f":"IF(SumSheet!BM19>0,SumSheet!C19,\"\")","v":"B"},29,-32,3,605.67000000000007,0,null,{"$f":"IF(ISNA(VLOOKUP($N17,SeriesSummary,ClassRank,FALSE)),\"\",VLOOKUP($N17,SeriesSummary,ClassRank,FALSE))","v":""},{"$f":"IF(ISNA(VLOOKUP($N17,SeriesSummary,ChangeInClassRank,FALSE)),\"\",VLOOKUP($N17,SeriesSummary,ChangeInClassRank,FALSE))","v":""},{"$f":"IF(AND(SumSheet!BM12>0,SumSheet!C12=\"A\"),SumSheet!B12,\"\")","v":""},"","","","","",null,{"$f":"IF(ISNA(VLOOKUP($W17,SeriesSummary,ClassRank,FALSE)),\"\",VLOOKUP($W17,SeriesSummary,ClassRank,FALSE))","v":""},{"$f":"IF(ISNA(VLOOKUP($W17,SeriesSummary,ChangeInClassRank,FALSE)),\"\",VLOOKUP($W17,SeriesSummary,ChangeInClassRank,FALSE))","v":""},{"$f":"IF(AND(SumSheet!BM14>0,SumSheet!C14=\"B\"),SumSheet!B14,\"\")","v":""},"","","","",""]
[null,{"$f":"IF(ISNA(VLOOKUP($D18,SeriesSummary,Rank,FALSE)),\"\",VLOOKUP($D18,SeriesSummary,Rank,FALSE))","v":12},{"$f":"IF(ISNA(VLOOKUP($D18,SeriesSummary,ChangeInRank,FALSE)),\"\",VLOOKUP($D18,SeriesSummary,ChangeInRank,FALSE))","v":"+1"},{"$f":"IF(SumSheet!BM13>0,SumSheet!B13,\"\")","v":"Brett L."},{"$f":"IF(SumSheet!BM13>0,SumSheet!C13,\"\")","v":"B"},29,-32,3,598.36,0,null,{"$f":"IF(ISNA(VLOOKUP($N18,SeriesSummary,ClassRank,FALSE)),\"\",VLOOKUP($N18,SeriesSummary,ClassRank,FALSE))","v":""},{"$f":"IF(ISNA(VLOOKUP($N18,SeriesSummary,ChangeInClassRank,FALSE)),\"\",VLOOKUP($N18,SeriesSummary,ChangeInClassRank,FALSE))","v":""},{"$f":"IF(AND(SumSheet!BM13>0,SumSheet!C13=\"A\"),SumSheet!B13,\"\")","v":""},"","","","","",null,{"$f":"IF(ISNA(VLOOKUP($W18,SeriesSummary,ClassRank,FALSE)),\"\",VLOOKUP($W18,SeriesSummary,ClassRank,FALSE))","v":""},{"$f":"IF(ISNA(VLOOKUP($W18,SeriesSummary,ChangeInClassRank,FALSE)),\"\",VLOOKUP($W18,SeriesSummary,ChangeInClassRank,FALSE))","v":""},{"$f":"IF(AND(SumSheet!BM15>0,SumSheet!C15=\"B\"),SumSheet!B15,\"\")","v":""},"","","","",""]
[null,{"$f":"IF(ISNA(VLOOKUP($D19,SeriesSummary,Rank,FALSE)),\"\",VLOOKUP($D19,SeriesSummary,Rank,FALSE))","v":13},{"$f":"IF(ISNA(VLOOKUP($D19,SeriesSummary,ChangeInRank,FALSE)),\"\",VLOOKUP($D19,SeriesSummary,ChangeInRank,FALSE))","v":-1},{"$f":"IF(SumSheet!BM24>0,SumSheet!B24,\"\")","v":"Randy A."},{"$f":"IF(SumSheet!BM24>0,SumSheet!C24,\"\")","v":"B"},25,-36,3,600.95000000000005,0,null,{"$f":"IF(ISNA(VLOOKUP($N19,SeriesSummary,ClassRank,FALSE)),\"\",VLOOKUP($N19,SeriesSummary,ClassRank,FALSE))","v":""},{"$f":"IF(ISNA(VLOOKUP($N19,SeriesSummary,ChangeInClassRank,FALSE)),\"\",VLOOKUP($N19,SeriesSummary,ChangeInClassRank,FALSE))","v":""},{"$f":"IF(AND(SumSheet!BM14>0,SumSheet!C14=\"A\"),SumSheet!B14,\"\")","v":""},"","","","","",null,{"$f":"IF(ISNA(VLOOKUP($W19,SeriesSummary,ClassRank,FALSE)),\"\",VLOOKUP($W19,SeriesSummary,ClassRank,FALSE))","v":""},{"$f":"IF(ISNA(VLOOKUP($W19,SeriesSummary,ChangeInClassRank,FALSE)),\"\",VLOOKUP($W19,SeriesSummary,ChangeInClassRank,FALSE))","v":""},{"$f":"IF(AND(SumSheet!BM17>0,SumSheet!C17=\"B\"),SumSheet!B17,\"\")","v":""},"","","","",""]
[null,{"$f":"IF(ISNA(VLOOKUP($D20,SeriesSummary,Rank,FALSE)),\"\",VLOOKUP($D20,SeriesSummary,Rank,FALSE))","v":14},{"$f":"IF(ISNA(VLOOKUP($D20,SeriesSummary,ChangeInRank,FALSE)),\"\",VLOOKUP($D20,SeriesSummary,ChangeInRank,FALSE))","v":"-"},{"$f":"IF(SumSheet!BM16>0,SumSheet!B16,\"\")","v":"John B."},{"$f":"IF(SumSheet!BM16>0,SumSheet!C16,\"\")","v":"B"},18,-43,2,402.04,0,null,{"$f":"IF(ISNA(VLOOKUP($N20,SeriesSummary,ClassRank,FALSE)),\"\",VLOOKUP($N20,SeriesSummary,ClassRank,FALSE))","v":""},{"$f":"IF(ISNA(VLOOKUP($N20,SeriesSummary,ChangeInClassRank,FALSE)),\"\",VLOOKUP($N20,SeriesSummary,ChangeInClassRank,FALSE))","v":""},{"$f":"IF(AND(SumSheet!BM16>0,SumSheet!C16=\"A\"),SumSheet!B16,\"\")","v":""},"","","","","",null,{"$f":"IF(ISNA(VLOOKUP($W20,SeriesSummary,ClassRank,FALSE)),\"\",VLOOKUP($W20,SeriesSummary,ClassRank,FALSE))","v":""},{"$f":"IF(ISNA(VLOOKUP($W20,SeriesSummary,ChangeInClassRank,FALSE)),\"\",VLOOKUP($W20,SeriesSummary,ChangeInClassRank,FALSE))","v":""},{"$f":"IF(AND(SumSheet!BM18>0,SumSheet!C18=\"B\"),SumSheet!B18,\"\")","v":""},"","","","",""]
[null,{"$f":"IF(ISNA(VLOOKUP($D21,SeriesSummary,Rank,FALSE)),\"\",VLOOKUP($D21,SeriesSummary,Rank,FALSE))","v":15},{"$f":"IF(ISNA(VLOOKUP($D21,SeriesSummary,ChangeInRank,FALSE)),\"\",VLOOKUP($D21,SeriesSummary,ChangeInRank,FALSE))","v":-1},{"$f":"IF(SumSheet!BM22>0,SumSheet!B22,\"\")","v":"Mitch A."},{"$f":"IF(SumSheet!BM22>0,SumSheet!C22,\"\")","v":"B"},16,-45,2,292,0,null,{"$f":"IF(ISNA(VLOOKUP($N21,SeriesSummary,ClassRank,FALSE)),\"\",VLOOKUP($N21,SeriesSummary,ClassRank,FALSE))","v":""},{"$f":"IF(ISNA(VLOOKUP($N21,SeriesSummary,ChangeInClassRank,FALSE)),\"\",VLOOKUP($N21,SeriesSummary,ChangeInClassRank,FALSE))","v":""},{"$f":"IF(AND(SumSheet!BM18>0,SumSheet!C18=\"A\"),SumSheet!B18,\"\")","v":""},"","","","","",null,{"$f":"IF(ISNA(VLOOKUP($W21,SeriesSummary,ClassRank,FALSE)),\"\",VLOOKUP($W21,SeriesSummary,ClassRank,FALSE))","v":""},{"$f":"IF(ISNA(VLOOKUP($W21,SeriesSummary,ChangeInClassRank,FALSE)),\"\",VLOOKUP($W21,SeriesSummary,ChangeInClassRank,FALSE))","v":""},{"$f":"IF(AND(SumSheet!BM20>0,SumSheet!C20=\"B\"),SumSheet!B20,\"\")","v":""},"","","","",""]
[null,{"$f":"IF(ISNA(VLOOKUP($D22,SeriesSummary,Rank,FALSE)),\"\",VLOOKUP($D22,SeriesSummary,Rank,FALSE))","v":""},{"$f":"IF(ISNA(VLOOKUP($D22,SeriesSummary,ChangeInRank,FALSE)),\"\",VLOOKUP($D22,SeriesSummary,ChangeInRank,FALSE))","v":""},{"$f":"IF(SumSheet!BM11>0,SumSheet!B11,\"\")","v":""},{"$f":"IF(SumSheet!BM11>0,SumSheet!C11,\"\")","v":""},"","","","","",null,{"$f":"IF(ISNA(VLOOKUP($N22,SeriesSummary,ClassRank,FALSE)),\"\",VLOOKUP($N22,SeriesSummary,ClassRank,FALSE))","v":""},{"$f":"IF(ISNA(VLOOKUP($N22,SeriesSummary,ChangeInClassRank,FALSE)),\"\",VLOOKUP($N22,SeriesSummary,ChangeInClassRank,FALSE))","v":""},{"$f":"IF(AND(SumSheet!BM19>0,SumSheet!C19=\"A\"),SumSheet!B19,\"\")","v":""},"","","","","",null,{"$f":"IF(ISNA(VLOOKUP($W22,SeriesSummary,ClassRank,FALSE)),\"\",VLOOKUP($W22,SeriesSummary,ClassRank,FALSE))","v":""},{"$f":"IF(ISNA(VLOOKUP($W22,SeriesSummary,ChangeInClassRank,FALSE)),\"\",VLOOKUP($W22,SeriesSummary,ChangeInClassRank,FALSE))","v":""},{"$f":"IF(AND(SumSheet!BM21>0,SumSheet!C21=\"B\"),SumSheet!B21,\"\")","v":""},"","","","",""]
[null,{"$f":"IF(ISNA(VLOOKUP($D23,SeriesSummary,Rank,FALSE)),\"\",VLOOKUP($D23,SeriesSummary,Rank,FALSE))","v":""},{"$f":"IF(ISNA(VLOOKUP($D23,SeriesSummary,ChangeInRank,FALSE)),\"\",VLOOKUP($D23,SeriesSummary,ChangeInRank,FALSE))","v":""},{"$f":"IF(SumSheet!BM12>0,SumSheet!B12,\"\")","v":""},{"$f":"IF(SumSheet!BM12>0,SumSheet!C12,\"\")","v":""},"","","","","",null,{"$f":"IF(ISNA(VLOOKUP($N23,SeriesSummary,ClassRank,FALSE)),\"\",VLOOKUP($N23,SeriesSummary,ClassRank,FALSE))","v":""},{"$f":"IF(ISNA(VLOOKUP($N23,SeriesSummary,ChangeInClassRank,FALSE)),\"\",VLOOKUP($N23,SeriesSummary,ChangeInClassRank,FALSE))","v":""},{"$f":"IF(AND(SumSheet!BM21>0,SumSheet!C21=\"A\"),SumSheet!B21,\"\")","v":""},"","","","","",null,{"$f":"IF(ISNA(VLOOKUP($W23,SeriesSummary,ClassRank,FALSE)),\"\",VLOOKUP($W23,SeriesSummary,ClassRank,FALSE))","v":""},{"$f":"IF(ISNA(VLOOKUP($W23,SeriesSummary,ChangeInClassRank,FALSE)),\"\",VLOOKUP($W23,SeriesSummary,ChangeInClassRank,FALSE))","v":""},{"$f":"IF(AND(SumSheet!BM23>0,SumSheet!C23=\"B\"),SumSheet!B23,\"\")","v":""},"","","","",""]
[null,{"$f":"IF(ISNA(VLOOKUP($D24,SeriesSummary,Rank,FALSE)),\"\",VLOOKUP($D24,SeriesSummary,Rank,FALSE))","v":""},{"$f":"IF(ISNA(VLOOKUP($D24,SeriesSummary,ChangeInRank,FALSE)),\"\",VLOOKUP($D24,SeriesSummary,ChangeInRank,FALSE))","v":""},{"$f":"IF(SumSheet!BM14>0,SumSheet!B14,\"\")","v":""},{"$f":"IF(SumSheet!BM14>0,SumSheet!C14,\"\")","v":""},"","","","","",null,{"$f":"IF(ISNA(VLOOKUP($N24,SeriesSummary,ClassRank,FALSE)),\"\",VLOOKUP($N24,SeriesSummary,ClassRank,FALSE))","v":""},{"$f":"IF(ISNA(VLOOKUP($N24,SeriesSummary,ChangeInClassRank,FALSE)),\"\",VLOOKUP($N24,SeriesSummary,ChangeInClassRank,FALSE))","v":""},{"$f":"IF(AND(SumSheet!BM22>0,SumSheet!C22=\"A\"),SumSheet!B22,\"\")","v":""},"","","","","",null,{"$f":"IF(ISNA(VLOOKUP($W24,SeriesSummary,ClassRank,FALSE)),\"\",VLOOKUP($W24,SeriesSummary,ClassRank,FALSE))","v":""},{"$f":"IF(ISNA(VLOOKUP($W24,SeriesSummary,ChangeInClassRank,FALSE)),\"\",VLOOKUP($W24,SeriesSummary,ChangeInClassRank,FALSE))","v":""},{"$f":"IF(AND(SumSheet!BM26>0,SumSheet!C26=\"B\"),SumSheet!B26,\"\")","v":""},"","","","",""]
[null,{"$f":"IF(ISNA(VLOOKUP($D25,SeriesSummary,Rank,FALSE)),\"\",VLOOKUP($D25,SeriesSummary,Rank,FALSE))","v":""},{"$f":"IF(ISNA(VLOOKUP($D25,SeriesSummary,ChangeInRank,FALSE)),\"\",VLOOKUP($D25,SeriesSummary,ChangeInRank,FALSE))","v":""},{"$f":"IF(SumSheet!BM18>0,SumSheet!B18,\"\")","v":""},{"$f":"IF(SumSheet!BM18>0,SumSheet!C18,\"\")","v":""},"","","","","",null,{"$f":"IF(ISNA(VLOOKUP($N25,SeriesSummary,ClassRank,FALSE)),\"\",VLOOKUP($N25,SeriesSummary,ClassRank,FALSE))","v":""},{"$f":"IF(ISNA(VLOOKUP($N25,SeriesSummary,ChangeInClassRank,FALSE)),\"\",VLOOKUP($N25,SeriesSummary,ChangeInClassRank,FALSE))","v":""},{"$f":"IF(AND(SumSheet!BM23>0,SumSheet!C23=\"A\"),SumSheet!B23,\"\")","v":""},"","","","","",null,{"$f":"IF(ISNA(VLOOKUP($W25,SeriesSummary,ClassRank,FALSE)),\"\",VLOOKUP($W25,SeriesSummary,ClassRank,FALSE))","v":""},{"$f":"IF(ISNA(VLOOKUP($W25,SeriesSummary,ChangeInClassRank,FALSE)),\"\",VLOOKUP($W25,SeriesSummary,ChangeInClassRank,FALSE))","v":""},{"$f":"IF(AND(SumSheet!BM27>0,SumSheet!C27=\"B\"),SumSheet!B27,\"\")","v":""},"","","","",""]
[null,{"$f":"IF(ISNA(VLOOKUP($D26,SeriesSummary,Rank,FALSE)),\"\",VLOOKUP($D26,SeriesSummary,Rank,FALSE))","v":""},{"$f":"IF(ISNA(VLOOKUP($D26,SeriesSummary,ChangeInRank,FALSE)),\"\",VLOOKUP($D26,SeriesSummary,ChangeInRank,FALSE))","v":""},{"$f":"IF(SumSheet!BM21>0,SumSheet!B21,\"\")","v":""},{"$f":"IF(SumSheet!BM21>0,SumSheet!C21,\"\")","v":""},"","","","","",null,{"$f":"IF(ISNA(VLOOKUP($N26,SeriesSummary,ClassRank,FALSE)),\"\",VLOOKUP($N26,SeriesSummary,ClassRank,FALSE))","v":""},{"$f":"IF(ISNA(VLOOKUP($N26,SeriesSummary,ChangeInClassRank,FALSE)),\"\",VLOOKUP($N26,SeriesSummary,ChangeInClassRank,FALSE))","v":""},{"$f":"IF(AND(SumSheet!BM24>0,SumSheet!C24=\"A\"),SumSheet!B24,\"\")","v":""},"","","","","",null,{"$f":"IF(ISNA(VLOOKUP($W26,SeriesSummary,ClassRank,FALSE)),\"\",VLOOKUP($W26,SeriesSummary,ClassRank,FALSE))","v":""},{"$f":"IF(ISNA(VLOOKUP($W26,SeriesSummary,ChangeInClassRank,FALSE)),\"\",VLOOKUP($W26,SeriesSummary,ChangeInClassRank,FALSE))","v":""},{"$f":"IF(AND(SumSheet!BM28>0,SumSheet!C28=\"B\"),SumSheet!B28,\"\")","v":""},"","","","",""]
[null,{"$f":"IF(ISNA(VLOOKUP($D27,SeriesSummary,Rank,FALSE)),\"\",VLOOKUP($D27,SeriesSummary,Rank,FALSE))","v":""},{"$f":"IF(ISNA(VLOOKUP($D27,SeriesSummary,ChangeInRank,FALSE)),\"\",VLOOKUP($D27,SeriesSummary,ChangeInRank,FALSE))","v":""},{"$f":"IF(SumSheet!BM23>0,SumSheet!B23,\"\")","v":""},{"$f":"IF(SumSheet!BM23>0,SumSheet!C23,\"\")","v":""},"","","","","",null,{"$f":"IF(ISNA(VLOOKUP($N27,SeriesSummary,ClassRank,FALSE)),\"\",VLOOKUP($N27,SeriesSummary,ClassRank,FALSE))","v":""},{"$f":"IF(ISNA(VLOOKUP($N27,SeriesSummary,ChangeInClassRank,FALSE)),\"\",VLOOKUP($N27,SeriesSummary,ChangeInClassRank,FALSE))","v":""},{"$f":"IF(AND(SumSheet!BM25>0,SumSheet!C25=\"A\"),SumSheet!B25,\"\")","v":""},"","","","","",null,{"$f":"IF(ISNA(VLOOKUP($W27,SeriesSummary,ClassRank,FALSE)),\"\",VLOOKUP($W27,SeriesSummary,ClassRank,FALSE))","v":""},{"$f":"IF(ISNA(VLOOKUP($W27,SeriesSummary,ChangeInClassRank,FALSE)),\"\",VLOOKUP($W27,SeriesSummary,ChangeInClassRank,FALSE))","v":""},{"$f":"IF(AND(SumSheet!BM29>0,SumSheet!C29=\"B\"),SumSheet!B29,\"\")","v":""},"","","","",""]
[null,{"$f":"IF(ISNA(VLOOKUP($D28,SeriesSummary,Rank,FALSE)),\"\",VLOOKUP($D28,SeriesSummary,Rank,FALSE))","v":""},{"$f":"IF(ISNA(VLOOKUP($D28,SeriesSummary,ChangeInRank,FALSE)),\"\",VLOOKUP($D28,SeriesSummary,ChangeInRank,FALSE))","v":""},{"$f":"IF(SumSheet!BM30>0,SumSheet!B30,\"\")","v":""},{"$f":"IF(SumSheet!BM30>0,SumSheet!C30,\"\")","v":""},"","","","","",null,{"$f":"IF(ISNA(VLOOKUP($N28,SeriesSummary,ClassRank,FALSE)),\"\",VLOOKUP($N28,SeriesSummary,ClassRank,FALSE))","v":""},{"$f":"IF(ISNA(VLOOKUP($N28,SeriesSummary,ChangeInClassRank,FALSE)),\"\",VLOOKUP($N28,SeriesSummary,ChangeInClassRank,FALSE))","v":""},{"$f":"IF(AND(SumSheet!BM30>0,SumSheet!C30=\"A\"),SumSheet!B30,\"\")","v":""},"","","","","",null,{"$f":"IF(ISNA(VLOOKUP($W28,SeriesSummary,ClassRank,FALSE)),\"\",VLOOKUP($W28,SeriesSummary,ClassRank,FALSE))","v":""},{"$f":"IF(ISNA(VLOOKUP($W28,SeriesSummary,ChangeInClassRank,FALSE)),\"\",VLOOKUP($W28,SeriesSummary,ChangeInClassRank,FALSE))","v":""},{"$f":"IF(AND(SumSheet!BM30>0,SumSheet!C30=\"B\"),SumSheet!B30,\"\")","v":""},"","","","",""]
[null,{"$f":"IF(ISNA(VLOOKUP($D29,SeriesSummary,Rank,FALSE)),\"\",VLOOKUP($D29,SeriesSummary,Rank,FALSE))","v":""},{"$f":"IF(ISNA(VLOOKUP($D29,SeriesSummary,ChangeInRank,FALSE)),\"\",VLOOKUP($D29,SeriesSummary,ChangeInRank,FALSE))","v":""},{"$f":"IF(SumSheet!BM31>0,SumSheet!B31,\"\")","v":""},{"$f":"IF(SumSheet!BM31>0,SumSheet!C31,\"\")","v":""},"","","","","",null,{"$f":"IF(ISNA(VLOOKUP($N29,SeriesSummary,ClassRank,FALSE)),\"\",VLOOKUP($N29,SeriesSummary,ClassRank,FALSE))","v":""},{"$f":"IF(ISNA(VLOOKUP($N29,SeriesSummary,ChangeInClassRank,FALSE)),\"\",VLOOKUP($N29,SeriesSummary,ChangeInClassRank,FALSE))","v":""},{"$f":"IF(AND(SumSheet!BM31>0,SumSheet!C31=\"A\"),SumSheet!B31,\"\")","v":""},"","","","","",null,{"$f":"IF(ISNA(VLOOKUP($W29,SeriesSummary,ClassRank,FALSE)),\"\",VLOOKUP($W29,SeriesSummary,ClassRank,FALSE))","v":""},{"$f":"IF(ISNA(VLOOKUP($W29,SeriesSummary,ChangeInClassRank,FALSE)),\"\",VLOOKUP($W29,SeriesSummary,ChangeInClassRank,FALSE))","v":""},{"$f":"IF(AND(SumSheet!BM31>0,SumSheet!C31=\"B\"),SumSheet!B31,\"\")","v":""},"","","","",""]
[null,{"$f":"IF(ISNA(VLOOKUP($D30,SeriesSummary,Rank,FALSE)),\"\",VLOOKUP($D30,SeriesSummary,Rank,FALSE))","v":""},{"$f":"IF(ISNA(VLOOKUP($D30,SeriesSummary,ChangeInRank,FALSE)),\"\",VLOOKUP($D30,SeriesSummary,ChangeInRank,FALSE))","v":""},{"$f":"IF(SumSheet!BM32>0,SumSheet!B32,\"\")","v":""},{"$f":"IF(SumSheet!BM32>0,SumSheet!C32,\"\")","v":""},"","","","","",null,{"$f":"IF(ISNA(VLOOKUP($N30,SeriesSummary,ClassRank,FALSE)),\"\",VLOOKUP($N30,SeriesSummary,ClassRank,FALSE))","v":""},{"$f":"IF(ISNA(VLOOKUP($N30,SeriesSummary,ChangeInClassRank,FALSE)),\"\",VLOOKUP($N30,SeriesSummary,ChangeInClassRank,FALSE))","v":""},{"$f":"IF(AND(SumSheet!BM32>0,SumSheet!C32=\"A\"),SumSheet!B32,\"\")","v":""},"","","","","",null,{"$f":"IF(ISNA(VLOOKUP($W30,SeriesSummary,ClassRank,FALSE)),\"\",VLOOKUP($W30,SeriesSummary,ClassRank,FALSE))","v":""},{"$f":"IF(ISNA(VLOOKUP($W30,SeriesSummary,ChangeInClassRank,FALSE)),\"\",VLOOKUP($W30,SeriesSummary,ChangeInClassRank,FALSE))","v":""},{"$f":"IF(AND(SumSheet!BM32>0,SumSheet!C32=\"B\"),SumSheet!B32,\"\")","v":""},"","","","",""]
[null,{"$f":"IF(ISNA(VLOOKUP($D31,SeriesSummary,Rank,FALSE)),\"\",VLOOKUP($D31,SeriesSummary,Rank,FALSE))","v":""},{"$f":"IF(ISNA(VLOOKUP($D31,SeriesSummary,ChangeInRank,FALSE)),\"\",VLOOKUP($D31,SeriesSummary,ChangeInRank,FALSE))","v":""},{"$f":"IF(SumSheet!BM33>0,SumSheet!B33,\"\")","v":""},{"$f":"IF(SumSheet!BM33>0,SumSheet!C33,\"\")","v":""},"","","","","",null,{"$f":"IF(ISNA(VLOOKUP($N31,SeriesSummary,ClassRank,FALSE)),\"\",VLOOKUP($N31,SeriesSummary,ClassRank,FALSE))","v":""},{"$f":"IF(ISNA(VLOOKUP($N31,SeriesSummary,ChangeInClassRank,FALSE)),\"\",VLOOKUP($N31,SeriesSummary,ChangeInClassRank,FALSE))","v":""},{"$f":"IF(AND(SumSheet!BM33>0,SumSheet!C33=\"A\"),SumSheet!B33,\"\")","v":""},"","","","","",null,{"$f":"IF(ISNA(VLOOKUP($W31,SeriesSummary,ClassRank,FALSE)),\"\",VLOOKUP($W31,SeriesSummary,ClassRank,FALSE))","v":""},{"$f":"IF(ISNA(VLOOKUP($W31,SeriesSummary,ChangeInClassRank,FALSE)),\"\",VLOOKUP($W31,SeriesSummary,ChangeInClassRank,FALSE))","v":""},{"$f":"IF(AND(SumSheet!BM33>0,SumSheet!C33=\"B\"),SumSheet!B33,\"\")","v":""},"","","","",""]
[null,{"$f":"IF(ISNA(VLOOKUP($D32,SeriesSummary,Rank,FALSE)),\"\",VLOOKUP($D32,SeriesSummary,Rank,FALSE))","v":""},{"$f":"IF(ISNA(VLOOKUP($D32,SeriesSummary,ChangeInRank,FALSE)),\"\",VLOOKUP($D32,SeriesSummary,ChangeInRank,FALSE))","v":""},{"$f":"IF(SumSheet!BM34>0,SumSheet!B34,\"\")","v":""},{"$f":"IF(SumSheet!BM34>0,SumSheet!C34,\"\")","v":""},"","","","","",null,{"$f":"IF(ISNA(VLOOKUP($N32,SeriesSummary,ClassRank,FALSE)),\"\",VLOOKUP($N32,SeriesSummary,ClassRank,FALSE))","v":""},{"$f":"IF(ISNA(VLOOKUP($N32,SeriesSummary,ChangeInClassRank,FALSE)),\"\",VLOOKUP($N32,SeriesSummary,ChangeInClassRank,FALSE))","v":""},{"$f":"IF(AND(SumSheet!BM34>0,SumSheet!C34=\"A\"),SumSheet!B34,\"\")","v":""},"","","","","",null,{"$f":"IF(ISNA(VLOOKUP($W32,SeriesSummary,ClassRank,FALSE)),\"\",VLOOKUP($W32,SeriesSummary,ClassRank,FALSE))","v":""},{"$f":"IF(ISNA(VLOOKUP($W32,SeriesSummary,ChangeInClassRank,FALSE)),\"\",VLOOKUP($W32,SeriesSummary,ChangeInClassRank,FALSE))","v":""},{"$f":"IF(AND(SumSheet!BM34>0,SumSheet!C34=\"B\"),SumSheet!B34,\"\")","v":""},"","","","",""]
[null,{"$f":"IF(ISNA(VLOOKUP($D33,SeriesSummary,Rank,FALSE)),\"\",VLOOKUP($D33,SeriesSummary,Rank,FALSE))","v":""},{"$f":"IF(ISNA(VLOOKUP($D33,SeriesSummary,ChangeInRank,FALSE)),\"\",VLOOKUP($D33,SeriesSummary,ChangeInRank,FALSE))","v":""},{"$f":"IF(SumSheet!BM35>0,SumSheet!B35,\"\")","v":""},{"$f":"IF(SumSheet!BM35>0,SumSheet!C35,\"\")","v":""},"","","","","",null,{"$f":"IF(ISNA(VLOOKUP($N33,SeriesSummary,ClassRank,FALSE)),\"\",VLOOKUP($N33,SeriesSummary,ClassRank,FALSE))","v":""},{"$f":"IF(ISNA(VLOOKUP($N33,SeriesSummary,ChangeInClassRank,FALSE)),\"\",VLOOKUP($N33,SeriesSummary,ChangeInClassRank,FALSE))","v":""},{"$f":"IF(AND(SumSheet!BM35>0,SumSheet!C35=\"A\"),SumSheet!B35,\"\")","v":""},"","","","","",null,{"$f":"IF(ISNA(VLOOKUP($W33,SeriesSummary,ClassRank,FALSE)),\"\",VLOOKUP($W33,SeriesSummary,ClassRank,FALSE))","v":""},{"$f":"IF(ISNA(VLOOKUP($W33,SeriesSummary,ChangeInClassRank,FALSE)),\"\",VLOOKUP($W33,SeriesSummary,ChangeInClassRank,FALSE))","v":""},{"$f":"IF(AND(SumSheet!BM35>0,SumSheet!C35=\"B\"),SumSheet!B35,\"\")","v":""},"","","","",""]
[null,{"$f":"IF(ISNA(VLOOKUP($D34,SeriesSummary,Rank,FALSE)),\"\",VLOOKUP($D34,SeriesSummary,Rank,FALSE))","v":""},{"$f":"IF(ISNA(VLOOKUP($D34,SeriesSummary,ChangeInRank,FALSE)),\"\",VLOOKUP($D34,SeriesSummary,ChangeInRank,FALSE))","v":""},{"$f":"IF(SumSheet!BM36>0,SumSheet!B36,\"\")","v":""},{"$f":"IF(SumSheet!BM36>0,SumSheet!C36,\"\")","v":""},"","","","","",null,{"$f":"IF(ISNA(VLOOKUP($N34,SeriesSummary,ClassRank,FALSE)),\"\",VLOOKUP($N34,SeriesSummary,ClassRank,FALSE))","v":""},{"$f":"IF(ISNA(VLOOKUP($N34,SeriesSummary,ChangeInClassRank,FALSE)),\"\",VLOOKUP($N34,SeriesSummary,ChangeInClassRank,FALSE))","v":""},{"$f":"IF(AND(SumSheet!BM36>0,SumSheet!C36=\"A\"),SumSheet!B36,\"\")","v":""},"","","","","",null,{"$f":"IF(ISNA(VLOOKUP($W34,SeriesSummary,ClassRank,FALSE)),\"\",VLOOKUP($W34,SeriesSummary,ClassRank,FALSE))","v":""},{"$f":"IF(ISNA(VLOOKUP($W34,SeriesSummary,ChangeInClassRank,FALSE)),\"\",VLOOKUP($W34,SeriesSummary,ChangeInClassRank,FALSE))","v":""},{"$f":"IF(AND(SumSheet!BM36>0,SumSheet!C36=\"B\"),SumSheet!B36,\"\")","v":""},"","","","",""]
[null,{"$f":"IF(ISNA(VLOOKUP($D35,SeriesSummary,Rank,FALSE)),\"\",VLOOKUP($D35,SeriesSummary,Rank,FALSE))","v":""},{"$f":"IF(ISNA(VLOOKUP($D35,SeriesSummary,ChangeInRank,FALSE)),\"\",VLOOKUP($D35,SeriesSummary,ChangeInRank,FALSE))","v":""},{"$f":"IF(SumSheet!BM37>0,SumSheet!B37,\"\")","v":""},{"$f":"IF(SumSheet!BM37>0,SumSheet!C37,\"\")","v":""},"","","","","",null,{"$f":"IF(ISNA(VLOOKUP($N35,SeriesSummary,ClassRank,FALSE)),\"\",VLOOKUP($N35,SeriesSummary,ClassRank,FALSE))","v":""},{"$f":"IF(ISNA(VLOOKUP($N35,SeriesSummary,ChangeInClassRank,FALSE)),\"\",VLOOKUP($N35,SeriesSummary,ChangeInClassRank,FALSE))","v":""},{"$f":"IF(AND(SumSheet!BM37>0,SumSheet!C37=\"A\"),SumSheet!B37,\"\")","v":""},"","","","","",null,{"$f":"IF(ISNA(VLOOKUP($W35,SeriesSummary,ClassRank,FALSE)),\"\",VLOOKUP($W35,SeriesSummary,ClassRank,FALSE))","v":""},{"$f":"IF(ISNA(VLOOKUP($W35,SeriesSummary,ChangeInClassRank,FALSE)),\"\",VLOOKUP($W35,SeriesSummary,ChangeInClassRank,FALSE))","v":""},{"$f":"IF(AND(SumSheet!BM37>0,SumSheet!C37=\"B\"),SumSheet!B37,\"\")","v":""},"","","","",""]
[null,{"$f":"IF(ISNA(VLOOKUP($D36,SeriesSummary,Rank,FALSE)),\"\",VLOOKUP($D36,SeriesSummary,Rank,FALSE))","v":""},{"$f":"IF(ISNA(VLOOKUP($D36,SeriesSummary,ChangeInRank,FALSE)),\"\",VLOOKUP($D36,SeriesSummary,ChangeInRank,FALSE))","v":""},{"$f":"IF(SumSheet!BM38>0,SumSheet!B38,\"\")","v":""},{"$f":"IF(SumSheet!BM38>0,SumSheet!C38,\"\")","v":""},"","","","","",null,{"$f":"IF(ISNA(VLOOKUP($N36,SeriesSummary,ClassRank,FALSE)),\"\",VLOOKUP($N36,SeriesSummary,ClassRank,FALSE))","v":""},{"$f":"IF(ISNA(VLOOKUP($N36,SeriesSummary,ChangeInClassRank,FALSE)),\"\",VLOOKUP($N36,SeriesSummary,ChangeInClassRank,FALSE))","v":""},{"$f":"IF(AND(SumSheet!BM38>0,SumSheet!C38=\"A\"),SumSheet!B38,\"\")","v":""},"","","","","",null,{"$f":"IF(ISNA(VLOOKUP($W36,SeriesSummary,ClassRank,FALSE)),\"\",VLOOKUP($W36,SeriesSummary,ClassRank,FALSE))","v":""},{"$f":"IF(ISNA(VLOOKUP($W36,SeriesSummary,ChangeInClassRank,FALSE)),\"\",VLOOKUP($W36,SeriesSummary,ChangeInClassRank,FALSE))","v":""},{"$f":"IF(AND(SumSheet!BM38>0,SumSheet!C38=\"B\"),SumSheet!B38,\"\")","v":""},"","","","",""]

{"sheet":"Round 1","index":1,"n_rows":67,"n_cols":8,"rows_kept":67,"cut":false,"hidden":false,"merged":[[1,1,1,7]]}
[]
[null,{"$f":"SeriesName & \" - Round 1\"","v":"2017 Group C / IMSA - Round 1"}]
[null,"Position","Driver","Laps","Fastest Lap","Group","Fastest Lap Bonus","Points"]
[null,1,"Marty M.",223.35,3.8679999999999999,{"$f":"IF(ISNA(VLOOKUP(C4,SeriesSummary,Group,FALSE)),\"\",VLOOKUP(C4,SeriesSummary,Group,FALSE))","v":"A"},{"$f":"IF(C4<>\"\",IF(AND(E4=MIN( IF( $F$4:$F$23=F4, $E$4:$E$23)),E4>0),1,0),\"\")","v":0},{"$f":"IF(ISNA(VLOOKUP(B4,Points,2,FALSE)),\"\",VLOOKUP(B4,Points,2,FALSE)+G4)","v":20}]
[null,2,"Ary B.",219.27,3.8090000000000002,"A",{"$f":"IF(C5<>\"\",IF(AND(E5=MIN( IF( $F$4:$F$23=F5, $E$4:$E$23)),E5>0),1,0),\"\")","v":1},20]
[null,3,"Russell M.",216.65,3.9630000000000001,"A",{"$f":"IF(C6<>\"\",IF(AND(E6=MIN( IF( $F$4:$F$23=F6, $E$4:$E$23)),E6>0),1,0),\"\")","v":0},18]
[null,4,"Jordan C.",213.44,4.0430000000000001,"A",{"$f":"IF(C7<>\"\",IF(AND(E7=MIN( IF( $F$4:$F$23=F7, $E$4:$E$23)),E7>0),1,0),\"\")","v":0},17]
[null,5,"Alejandro G.",208.3,3.923,"A",{"$f":"IF(C8<>\"\",IF(AND(E8=MIN( IF( $F$4:$F$23=F8, $E$4:$E$23)),E8>0),1,0),\"\")","v":0},16]
[null,6,"Rich C.",205.85,3.9910000000000001,"B",{"$f":"IF(C9<>\"\",IF(AND(E9=MIN( IF( $F$4:$F$23=F9, $E$4:$E$23)),E9>0),1,0),\"\")","v":1},16]
[null,7,"Roy M.",205.05,4.1070000000000002,"A",{"$f":"IF(C10<>\"\",IF(AND(E10=MIN( IF( $F$4:$F$23=F10, $E$4:$E$23)),E10>0),1,0),\"\")","v":0},14]
[null,8,"Stephen B.",204.95,3.9159999999999999,"A",{"$f":"IF(C11<>\"\",IF(AND(E11=MIN( IF( $F$4:$F$23=F11, $E$4:$E$23)),E11>0),1,0),\"\")","v":0},13]
[null,9,"Mark L.",201.83,4.1449999999999996,"B",{"$f":"IF(C12<>\"\",IF(AND(E12=MIN( IF( $F$4:$F$23=F12, $E$4:$E$23)),E12>0),1,0),\"\")","v":0},12]
[null,10,"David C.",199.85,4.0460000000000003,"A",{"$f":"IF(C13<>\"\",IF(AND(E13=MIN( IF( $F$4:$F$23=F13, $E$4:$E$23)),E13>0),1,0),\"\")","v":0},11]
[null,11,"John B.",198.68,4.2190000000000003,"B",{"$f":"IF(C14<>\"\",IF(AND(E14=MIN( IF( $F$4:$F$23=F14, $E$4:$E$23)),E14>0),1,0),\"\")","v":0},10]
[null,12,"Randy A.",197.78,4.1289999999999996,"B",{"$f":"IF(C15<>\"\",IF(AND(E15=MIN( IF( $F$4:$F$23=F15, $E$4:$E$23)),E15>0),1,0),\"\")","v":0},9]
[null,13,"Shawn G.",195.99,4.0620000000000003,"A",{"$f":"IF(C16<>\"\",IF(AND(E16=MIN( IF( $F$4:$F$23=F16, $E$4:$E$23)),E16>0),1,0),\"\")","v":0},8]
[null,14,"Brett L.",184.85,4.2549999999999999,"B",{"$f":"IF(C17<>\"\",IF(AND(E17=MIN( IF( $F$4:$F$23=F17, $E$4:$E$23)),E17>0),1,0),\"\")","v":0},7]
[null,null,null,null,null,"",{"$f":"IF(C18<>\"\",IF(AND(E18=MIN( IF( $F$4:$F$23=F18, $E$4:$E$23)),E18>0),1,0),\"\")","v":""},""]
[null,null,null,null,null,"",{"$f":"IF(C19<>\"\",IF(AND(E19=MIN( IF( $F$4:$F$23=F19, $E$4:$E$23)),E19>0),1,0),\"\")","v":""},""]
[null,null,null,null,null,"",{"$f":"IF(C20<>\"\",IF(AND(E20=MIN( IF( $F$4:$F$23=F20, $E$4:$E$23)),E20>0),1,0),\"\")","v":""},""]
[null,null,null,null,null,"",{"$f":"IF(C21<>\"\",IF(AND(E21=MIN( IF( $F$4:$F$23=F21, $E$4:$E$23)),E21>0),1,0),\"\")","v":""},""]
[null,null,null,null,null,"",{"$f":"IF(C22<>\"\",IF(AND(E22=MIN( IF( $F$4:$F$23=F22, $E$4:$E$23)),E22>0),1,0),\"\")","v":""},""]
[null,null,null,null,null,"",{"$f":"IF(C23<>\"\",IF(AND(E23=MIN( IF( $F$4:$F$23=F23, $E$4:$E$23)),E23>0),1,0),\"\")","v":""},""]
[]
[null,"Driver","Lane","Slowest Lap Time","Fastest Lap Time","Average Lap Time","Total Laps"]
[null,"Marty M.",1,4.7839999999999998,3.8679999999999999,4.0199999999999996,75.349999999999994]
[null,"Marty M.",2,5.2549999999999999,3.883,4.0369999999999999,74]
[null,"Marty M.",3,8.0470000000000006,3.9020000000000001,4.1029999999999998,74]
[null,"Ary B.",1,7.7729999999999997,3.8090000000000002,3.9969999999999999,76.27]
[null,"Ary B.",2,9.11,3.915,4.1769999999999996,72]
[null,"Ary B.",3,6.0730000000000004,3.956,4.2050000000000001,71]
[null,"Russell M.",1,5.9240000000000004,3.9630000000000001,4.1529999999999996,72.650000000000006]
[null,"Russell M.",2,4.3120000000000003,3.9820000000000002,4.069,74]
[null,"Russell M.",3,6.0330000000000004,4,4.2460000000000004,70]
[null,"Jordan C.",1,7.6239999999999997,4.0430000000000001,4.3220000000000001,69.44]
[null,"Jordan C.",2,5.6779999999999999,4.0449999999999999,4.1749999999999998,72]
[null,"Jordan C.",3,4.47,4.056,4.1580000000000004,72]
[null,"Alejandro G.",1,6.0419999999999998,3.996,4.5549999999999997,65.3]
[null,"Alejandro G.",2,6.61,3.923,4.1980000000000004,72]
[null,"Alejandro G.",3,8.3889999999999993,3.9809999999999999,4.234,71]
[null,"Rich C.",1,6.7759999999999998,4.0279999999999996,4.367,68.849999999999994]
[null,"Rich C.",2,6.8529999999999998,3.9910000000000001,4.3810000000000002,68]
[null,"Rich C.",3,6.1920000000000002,4.0229999999999997,4.3680000000000003,69]
[null,"Roy M.",1,6.8570000000000002,4.1120000000000001,4.3689999999999998,69.05]
[null,"Roy M.",2,6.5570000000000004,4.1070000000000002,4.3520000000000003,69]
[null,"Roy M.",3,7.8289999999999997,4.1139999999999999,4.452,67]
[null,"Stephen B.",1,5.9269999999999996,3.9209999999999998,4.0949999999999998,73]
[null,"Stephen B.",2,6.8040000000000003,3.9159999999999999,4.2850000000000001,70]
[null,"Stephen B.",3,14.225,4.0049999999999999,4.8730000000000002,61.95]
[null,"Mark L.",1,8.5280000000000005,4.2039999999999997,4.6210000000000004,64.83]
[null,"Mark L.",2,7.0609999999999999,4.1449999999999996,4.3570000000000002,68]
[null,"Mark L.",3,8.6989999999999998,4.173,4.4649999999999999,69]
[null,"David C.",1,41.079000000000001,4.0460000000000003,4.8689999999999998,61.85]
[null,"David C.",2,5.3769999999999998,4.1429999999999998,4.3390000000000004,69]
[null,"David C.",3,7.2779999999999996,4.0869999999999997,4.3470000000000004,69]
[null,"John B.",1,6.3520000000000003,4.335,4.5599999999999996,65.680000000000007]
[null,"John B.",2,7.0810000000000004,4.2240000000000002,4.5,66]
[null,"John B.",3,8.4480000000000004,4.2190000000000003,4.59,67]
[null,"Randy A.",1,6.1479999999999997,4.226,4.4800000000000004,66.78]
[null,"Randy A.",2,7.8970000000000002,4.1289999999999996,4.5220000000000002,66]
[null,"Randy A.",3,8.1660000000000004,4.274,4.6440000000000001,65]
[null,"Shawn G.",1,4.8019999999999996,4.0620000000000003,4.21,71.989999999999995]
[null,"Shawn G.",2,25.920999999999999,4.4909999999999997,5.1559999999999997,58]
[null,"Shawn G.",3,4.8289999999999997,4.2279999999999998,4.508,66]
[null,"Brett L.",1,31.105,4.2930000000000001,5.1849999999999996,57.85]
[null,"Brett L.",2,9.8170000000000002,4.2549999999999999,4.6379999999999999,65]
[null,"Brett L.",3,7.7489999999999997,4.319,4.867,62]

{"sheet":"Round 2","index":2,"n_rows":67,"n_cols":8,"rows_kept":67,"cut":false,"hidden":false,"merged":[[1,1,1,7]]}
[]
[null,{"$f":"SeriesName & \" - Round 2\"","v":"2017 Group C / IMSA - Round 2"}]
[null,"Position","Driver","Laps","Fastest Lap","Group","Fastest Lap Bonus","Points"]
[null,1,"Ary B.",227.4,3.778,{"$f":"IF(ISNA(VLOOKUP(C4,SeriesSummary,Group,FALSE)),\"\",VLOOKUP(C4,SeriesSummary,Group,FALSE))","v":"A"},{"$f":"IF(C4<>\"\",IF(AND(E4=MIN( IF( $F$4:$F$23=F4, $E$4:$E$23)),E4>0),1,0),\"\")","v":1},{"$f":"IF(ISNA(VLOOKUP(B4,Points,2,FALSE)),\"\",VLOOKUP(B4,Points,2,FALSE)+G4)","v":21}]
[null,2,"Marty M.",223.83,3.895,"A",{"$f":"IF(C5<>\"\",IF(AND(E5=MIN( IF( $F$4:$F$23=F5, $E$4:$E$23)),E5>0),1,0),\"\")","v":0},19]
[null,3,"David C.",221.68,3.7879999999999998,"A",{"$f":"IF(C6<>\"\",IF(AND(E6=MIN( IF( $F$4:$F$23=F6, $E$4:$E$23)),E6>0),1,0),\"\")","v":0},18]
[null,4,"Stephen B.",216.5,3.9039999999999999,"A",{"$f":"IF(C7<>\"\",IF(AND(E7=MIN( IF( $F$4:$F$23=F7, $E$4:$E$23)),E7>0),1,0),\"\")","v":0},17]
[null,5,"Jordan C.",215.22,4.024,"A",{"$f":"IF(C8<>\"\",IF(AND(E8=MIN( IF( $F$4:$F$23=F8, $E$4:$E$23)),E8>0),1,0),\"\")","v":0},16]
[null,6,"Alejandro G.",214.01,3.9169999999999998,"A",{"$f":"IF(C9<>\"\",IF(AND(E9=MIN( IF( $F$4:$F$23=F9, $E$4:$E$23)),E9>0),1,0),\"\")","v":0},15]
[null,7,"Shawn G.",213.25,4.0679999999999996,"A",{"$f":"IF(C10<>\"\",IF(AND(E10=MIN( IF( $F$4:$F$23=F10, $E$4:$E$23)),E10>0),1,0),\"\")","v":0},14]
[null,8,"Rich C.",210.35,3.9340000000000002,"B",{"$f":"IF(C11<>\"\",IF(AND(E11=MIN( IF( $F$4:$F$23=F11, $E$4:$E$23)),E11>0),1,0),\"\")","v":1},14]
[null,9,"Roy M.",208.4,4.0010000000000003,"A",{"$f":"IF(C12<>\"\",IF(AND(E12=MIN( IF( $F$4:$F$23=F12, $E$4:$E$23)),E12>0),1,0),\"\")","v":0},12]
[null,10,"Brett L.",205.75,4.0069999999999997,"B",{"$f":"IF(C13<>\"\",IF(AND(E13=MIN( IF( $F$4:$F$23=F13, $E$4:$E$23)),E13>0),1,0),\"\")","v":0},11]
[null,11,"Mitch A.",205,4.1609999999999996,"B",{"$f":"IF(C14<>\"\",IF(AND(E14=MIN( IF( $F$4:$F$23=F14, $E$4:$E$23)),E14>0),1,0),\"\")","v":0},10]
[null,12,"Randy A.",201.02,4.1760000000000002,"B",{"$f":"IF(C15<>\"\",IF(AND(E15=MIN( IF( $F$4:$F$23=F15, $E$4:$E$23)),E15>0),1,0),\"\")","v":0},9]
[null,13,"Mark L.",200.47,4.1210000000000004,"B",{"$f":"IF(C16<>\"\",IF(AND(E16=MIN( IF( $F$4:$F$23=F16, $E$4:$E$23)),E16>0),1,0),\"\")","v":0},8]
[null,14,"Russell M.",194.34,3.984,"A",{"$f":"IF(C17<>\"\",IF(AND(E17=MIN( IF( $F$4:$F$23=F17, $E$4:$E$23)),E17>0),1,0),\"\")","v":0},7]
[null,null,null,null,null,"",{"$f":"IF(C18<>\"\",IF(AND(E18=MIN( IF( $F$4:$F$23=F18, $E$4:$E$23)),E18>0),1,0),\"\")","v":""},""]
[null,null,null,null,null,"",{"$f":"IF(C19<>\"\",IF(AND(E19=MIN( IF( $F$4:$F$23=F19, $E$4:$E$23)),E19>0),1,0),\"\")","v":""},""]
[null,null,null,null,null,"",{"$f":"IF(C20<>\"\",IF(AND(E20=MIN( IF( $F$4:$F$23=F20, $E$4:$E$23)),E20>0),1,0),\"\")","v":""},""]
[null,null,null,null,null,"",{"$f":"IF(C21<>\"\",IF(AND(E21=MIN( IF( $F$4:$F$23=F21, $E$4:$E$23)),E21>0),1,0),\"\")","v":""},""]
[null,null,null,null,null,"",{"$f":"IF(C22<>\"\",IF(AND(E22=MIN( IF( $F$4:$F$23=F22, $E$4:$E$23)),E22>0),1,0),\"\")","v":""},""]
[null,null,null,null,null,"",{"$f":"IF(C23<>\"\",IF(AND(E23=MIN( IF( $F$4:$F$23=F23, $E$4:$E$23)),E23>0),1,0),\"\")","v":""},""]
[]
[null,"Driver","Lane","Slowest Lap Time","Fastest Lap Time","Average Lap Time","Total Laps"]
[null,"Ary B.",1,5.149,3.778,3.956,75.400000000000006]
[null,"Ary B.",2,4.1440000000000001,3.8519999999999999,3.9620000000000002,76]
[null,"Ary B.",3,4.1360000000000001,3.847,3.95,76]
[null,"Marty M.",1,4.9269999999999996,3.903,4.008,74.83]
[null,"Marty M.",2,4.2329999999999997,3.895,4.0030000000000001,75]
[null,"Marty M.",3,4.37,3.9209999999999998,4.0449999999999999,74]
[null,"David C.",1,6.0179999999999998,3.7879999999999998,4.0119999999999996,74.680000000000007]
[null,"David C.",2,6.0789999999999997,3.8559999999999999,4.0629999999999997,74]
[null,"David C.",3,6.02,3.9020000000000001,4.1050000000000004,73]
[null,"Stephen B.",1,5.649,3.9140000000000001,4.0839999999999996,73.5]
[null,"Stephen B.",2,6.5419999999999998,4.0460000000000003,4.2690000000000001,70]
[null,"Stephen B.",3,5.7859999999999996,3.9039999999999999,4.0970000000000004,73]
[null,"Jordan C.",1,5.5750000000000002,4.0369999999999999,4.1559999999999997,72]
[null,"Jordan C.",2,6.8390000000000004,4.024,4.1950000000000003,71.22]
[null,"Jordan C.",3,8.2780000000000005,4.0599999999999996,4.2320000000000002,72]
[null,"Alejandro G.",1,8.2279999999999998,3.923,4.21,73.010000000000005]
[null,"Alejandro G.",2,6.1710000000000003,3.9169999999999998,4.12,73]
[null,"Alejandro G.",3,8.16,4.0350000000000001,4.3520000000000003,68]
[null,"Shawn G.",1,6.266,4.085,4.2089999999999996,71.25]
[null,"Shawn G.",2,5.9720000000000004,4.1379999999999999,4.2350000000000003,71]
[null,"Shawn G.",3,6.7779999999999996,4.0679999999999996,4.2190000000000003,71]
[null,"Rich C.",1,5.8639999999999999,3.9340000000000002,4.2080000000000002,71.349999999999994]
[null,"Rich C.",2,6.3550000000000004,3.9830000000000001,4.2149999999999999,71]
[null,"Rich C.",3,6.6509999999999998,3.9820000000000002,4.4180000000000001,68]
[null,"Roy M.",1,6.6219999999999999,4.0010000000000003,4.2519999999999998,70.400000000000006]
[null,"Roy M.",2,4.734,4.05,4.298,70]
[null,"Roy M.",3,6.7949999999999999,4.024,4.42,68]
[null,"Brett L.",1,6.64,4.0069999999999997,4.3070000000000004,69.75]
[null,"Brett L.",2,5.8360000000000003,4.03,4.3,69]
[null,"Brett L.",3,6.9770000000000003,4.1120000000000001,4.5090000000000003,67]
[null,"Mitch A.",1,4.8289999999999997,4.2270000000000003,4.3579999999999997,68]
[null,"Mitch A.",2,7.6820000000000004,4.173,4.4260000000000002,68]
[null,"Mitch A.",3,4.5599999999999996,4.1609999999999996,4.3449999999999998,69]
[null,"Randy A.",1,8.65,4.2229999999999999,4.6109999999999998,66.02]
[null,"Randy A.",2,8.5820000000000007,4.1760000000000002,4.4189999999999996,69]
[null,"Randy A.",3,7.5190000000000001,4.26,4.5330000000000004,66]
[null,"Mark L.",1,8.8040000000000003,4.1639999999999997,4.5839999999999996,66.47]
[null,"Mark L.",2,6.5529999999999999,4.1909999999999998,4.4189999999999996,67]
[null,"Mark L.",3,6.7309999999999999,4.1210000000000004,4.4630000000000001,67]
[null,"Russell M.",1,7.81,4.0579999999999998,4.327,69.34]
[null,"Russell M.",2,12.395,3.984,4.508,54]
[null,"Russell M.",3,7.4889999999999999,4.0350000000000001,4.1980000000000004,71]

{"sheet":"Round 3","index":3,"n_rows":70,"n_cols":8,"rows_kept":70,"cut":false,"hidden":false,"merged":[[1,1,1,7]]}
[]
[null,{"$f":"SeriesName & \" - Round 3\"","v":"2017 Group C / IMSA - Round 3"}]
[null,"Position","Driver","Laps","Fastest Lap","Group","Fastest Lap Bonus","Points"]
[null,1,"Ary B.",225.75,3.8570000000000002,{"$f":"IF(ISNA(VLOOKUP(C4,SeriesSummary,Group,FALSE)),\"\",VLOOKUP(C4,SeriesSummary,Group,FALSE))","v":"A"},{"$f":"IF(C4<>\"\",IF(AND(E4=MIN( IF( $F$4:$F$23=F4, $E$4:$E$23)),E4>0),1,0),\"\")","v":0},{"$f":"IF(ISNA(VLOOKUP(B4,Points,2,FALSE)),\"\",VLOOKUP(B4,Points,2,FALSE)+G4)","v":20}]
[null,2,"David C.",222.74,3.7749999999999999,"A",{"$f":"IF(C5<>\"\",IF(AND(E5=MIN( IF( $F$4:$F$23=F5, $E$4:$E$23)),E5>0),1,0),\"\")","v":1},20]
[null,3,"Marty M.",219.75,3.919,"A",{"$f":"IF(C6<>\"\",IF(AND(E6=MIN( IF( $F$4:$F$23=F6, $E$4:$E$23)),E6>0),1,0),\"\")","v":0},18]
[null,4,"Jordan C.",213.5,4.0469999999999997,"A",{"$f":"IF(C7<>\"\",IF(AND(E7=MIN( IF( $F$4:$F$23=F7, $E$4:$E$23)),E7>0),1,0),\"\")","v":0},17]
[null,5,"Rich C.",213.3,3.923,"B",{"$f":"IF(C8<>\"\",IF(AND(E8=MIN( IF( $F$4:$F$23=F8, $E$4:$E$23)),E8>0),1,0),\"\")","v":1},17]
[null,6,"Alejandro G.",212.36,3.9590000000000001,"A",{"$f":"IF(C9<>\"\",IF(AND(E9=MIN( IF( $F$4:$F$23=F9, $E$4:$E$23)),E9>0),1,0),\"\")","v":0},15]
[null,7,"Roy M.",212.13,4.0209999999999999,"A",{"$f":"IF(C10<>\"\",IF(AND(E10=MIN( IF( $F$4:$F$23=F10, $E$4:$E$23)),E10>0),1,0),\"\")","v":0},14]
[null,8,"Shawn G.",211.36,4.0890000000000004,"A",{"$f":"IF(C11<>\"\",IF(AND(E11=MIN( IF( $F$4:$F$23=F11, $E$4:$E$23)),E11>0),1,0),\"\")","v":0},13]
[null,9,"Russell M.",210.76,3.9910000000000001,"A",{"$f":"IF(C12<>\"\",IF(AND(E12=MIN( IF( $F$4:$F$23=F12, $E$4:$E$23)),E12>0),1,0),\"\")","v":0},12]
[null,10,"Brett L.",207.76,4.0599999999999996,"B",{"$f":"IF(C13<>\"\",IF(AND(E13=MIN( IF( $F$4:$F$23=F13, $E$4:$E$23)),E13>0),1,0),\"\")","v":0},11]
[null,11,"Stephen B.",203.8,4.1310000000000002,"A",{"$f":"IF(C14<>\"\",IF(AND(E14=MIN( IF( $F$4:$F$23=F14, $E$4:$E$23)),E14>0),1,0),\"\")","v":0},10]
[null,12,"Mark L.",203.37,4.1130000000000004,"B",{"$f":"IF(C15<>\"\",IF(AND(E15=MIN( IF( $F$4:$F$23=F15, $E$4:$E$23)),E15>0),1,0),\"\")","v":0},9]
[null,13,"John B.",203.36,4.1100000000000003,"B",{"$f":"IF(C16<>\"\",IF(AND(E16=MIN( IF( $F$4:$F$23=F16, $E$4:$E$23)),E16>0),1,0),\"\")","v":0},8]
[null,14,"Randy A.",202.15,4.1120000000000001,"B",{"$f":"IF(C17<>\"\",IF(AND(E17=MIN( IF( $F$4:$F$23=F17, $E$4:$E$23)),E17>0),1,0),\"\")","v":0},7]
[null,15,"Mitch A.",87,4.069,"B",{"$f":"IF(C18<>\"\",IF(AND(E18=MIN( IF( $F$4:$F$23=F18, $E$4:$E$23)),E18>0),1,0),\"\")","v":0},6]
[null,null,null,null,null,"",{"$f":"IF(C19<>\"\",IF(AND(E19=MIN( IF( $F$4:$F$23=F19, $E$4:$E$23)),E19>0),1,0),\"\")","v":""},""]
[null,null,null,null,null,"",{"$f":"IF(C20<>\"\",IF(AND(E20=MIN( IF( $F$4:$F$23=F20, $E$4:$E$23)),E20>0),1,0),\"\")","v":""},""]
[null,null,null,null,null,"",{"$f":"IF(C21<>\"\",IF(AND(E21=MIN( IF( $F$4:$F$23=F21, $E$4:$E$23)),E21>0),1,0),\"\")","v":""},""]
[null,null,null,null,null,"",{"$f":"IF(C22<>\"\",IF(AND(E22=MIN( IF( $F$4:$F$23=F22, $E$4:$E$23)),E22>0),1,0),\"\")","v":""},""]
[null,null,null,null,null,"",{"$f":"IF(C23<>\"\",IF(AND(E23=MIN( IF( $F$4:$F$23=F23, $E$4:$E$23)),E23>0),1,0),\"\")","v":""},""]
[]
[null,"Driver","Lane","Slowest Lap Time","Fastest Lap Time","Average Lap Time","Total Laps"]
[null,"Ary B.",1,4.7389999999999999,3.8570000000000002,3.97,75.75]
[null,"Ary B.",2,4.6859999999999999,3.88,3.9980000000000002,75]
[null,"Ary B.",3,5.3760000000000003,3.8769999999999998,3.99,75]
[null,"David C.",1,5.7249999999999996,3.8130000000000002,3.9870000000000001,75.739999999999995]
[null,"David C.",2,4.524,3.7749999999999999,3.9620000000000002,75]
[null,"David C.",3,8.0329999999999995,3.8919999999999999,4.2279999999999998,72]
[null,"Marty M.",1,6.1360000000000001,3.9220000000000002,4.0940000000000003,73.75]
[null,"Marty M.",2,4.3689999999999998,3.9489999999999998,4.0979999999999999,73]
[null,"Marty M.",3,5.8689999999999998,3.919,4.0869999999999997,73]
[null,"Jordan C.",1,6.2990000000000004,4.0549999999999997,4.2350000000000003,70.5]
[null,"Jordan C.",2,6.44,4.0469999999999997,4.2060000000000004,71]
[null,"Jordan C.",3,4.4829999999999997,4.0620000000000003,4.1989999999999998,72]
[null,"Rich C.",1,8.2539999999999996,4.0469999999999997,4.351,70.3]
[null,"Rich C.",2,6.7409999999999997,3.923,4.1820000000000004,72]
[null,"Rich C.",3,6.0579999999999998,3.93,4.1909999999999998,71]
[null,"Alejandro G.",1,8.2409999999999997,3.9590000000000001,4.4139999999999997,71.36]
[null,"Alejandro G.",2,6.6689999999999996,3.9910000000000001,4.234,70]
[null,"Alejandro G.",3,6.2569999999999997,3.9889999999999999,4.1989999999999998,71]
[null,"Roy M.",1,4.8920000000000003,4.0209999999999999,4.17,71.13]
[null,"Roy M.",2,8.5,4.0309999999999997,4.335,71]
[null,"Roy M.",3,6.101,4.0830000000000002,4.2850000000000001,70]
[null,"Shawn G.",1,8.5489999999999995,4.1139999999999999,4.2779999999999996,71.36]
[null,"Shawn G.",2,5.9470000000000001,4.1289999999999996,4.306,70]
[null,"Shawn G.",3,6.4009999999999998,4.0890000000000004,4.24,70]
[null,"Russell M.",1,6.444,4.0289999999999999,4.2359999999999998,70.760000000000005]
[null,"Russell M.",2,8.032,3.9910000000000001,4.2309999999999999,71]
[null,"Russell M.",3,6.335,4.0730000000000004,4.3490000000000002,69]
[null,"Brett L.",1,6.609,4.07,4.2830000000000004,69.760000000000005]
[null,"Brett L.",2,6.8140000000000001,4.0709999999999997,4.2530000000000001,70]
[null,"Brett L.",3,9.4819999999999993,4.0599999999999996,4.4560000000000004,68]
[null,"Stephen B.",1,5.8780000000000001,4.1340000000000003,4.3879999999999999,68.8]
[null,"Stephen B.",2,6.53,4.1310000000000002,4.4329999999999998,67]
[null,"Stephen B.",3,7.29,4.1390000000000002,4.4210000000000003,68]
[null,"Mark L.",1,7.7939999999999996,4.1909999999999998,4.4580000000000002,67.37]
[null,"Mark L.",2,6.6210000000000004,4.1130000000000004,4.3179999999999996,70]
[null,"Mark L.",3,8.1809999999999992,4.1840000000000002,4.5,66]
[null,"John B.",1,6.3639999999999999,4.1100000000000003,4.42,69.36]
[null,"John B.",2,6.4720000000000004,4.133,4.3620000000000001,69]
[null,"John B.",3,5.9980000000000002,4.2329999999999997,4.5780000000000003,65]
[null,"Randy A.",1,7.5590000000000002,4.1120000000000001,4.327,69.150000000000006]
[null,"Randy A.",2,8.3149999999999995,4.1639999999999997,4.4960000000000004,68]
[null,"Randy A.",3,10.323,4.2169999999999996,4.609,65]
[null,"Mitch A.",1,11.715,4.069,4.4630000000000001,68]
[null,"Mitch A.",2,"--","--","--",0]
[null,"Mitch A.",3,6.9880000000000004,4.1539999999999999,4.6840000000000002,19]

{"sheet":"Round 4","index":4,"n_rows":25,"n_cols":8,"rows_kept":25,"cut":false,"hidden":false,"merged":[[1,1,1,7]]}
[]
[null,{"$f":"SeriesName & \" - Round 4\"","v":"2017 Group C / IMSA - Round 4"}]
[null,"Position","Driver","Laps","Fastest Lap","Group","Fastest Lap Bonus","Points"]
[null,null,null,null,null,{"$f":"IF(ISNA(VLOOKUP(C4,SeriesSummary,Group,FALSE)),\"\",VLOOKUP(C4,SeriesSummary,Group,FALSE))","v":""},{"$f":"IF(C4<>\"\",IF(AND(E4=MIN( IF( $F$4:$F$23=F4, $E$4:$E$23)),E4>0),1,0),\"\")","v":""},{"$f":"IF(ISNA(VLOOKUP(B4,Points,2,FALSE)),\"\",VLOOKUP(B4,Points,2,FALSE)+G4)","v":""}]
[null,null,null,null,null,"",{"$f":"IF(C5<>\"\",IF(AND(E5=MIN( IF( $F$4:$F$23=F5, $E$4:$E$23)),E5>0),1,0),\"\")","v":""},""]
[null,null,null,null,null,"",{"$f":"IF(C6<>\"\",IF(AND(E6=MIN( IF( $F$4:$F$23=F6, $E$4:$E$23)),E6>0),1,0),\"\")","v":""},""]
[null,null,null,null,null,"",{"$f":"IF(C7<>\"\",IF(AND(E7=MIN( IF( $F$4:$F$23=F7, $E$4:$E$23)),E7>0),1,0),\"\")","v":""},""]
[null,null,null,null,null,"",{"$f":"IF(C8<>\"\",IF(AND(E8=MIN( IF( $F$4:$F$23=F8, $E$4:$E$23)),E8>0),1,0),\"\")","v":""},""]
[null,null,null,null,null,"",{"$f":"IF(C9<>\"\",IF(AND(E9=MIN( IF( $F$4:$F$23=F9, $E$4:$E$23)),E9>0),1,0),\"\")","v":""},""]
[null,null,null,null,null,"",{"$f":"IF(C10<>\"\",IF(AND(E10=MIN( IF( $F$4:$F$23=F10, $E$4:$E$23)),E10>0),1,0),\"\")","v":""},""]
[null,null,null,null,null,"",{"$f":"IF(C11<>\"\",IF(AND(E11=MIN( IF( $F$4:$F$23=F11, $E$4:$E$23)),E11>0),1,0),\"\")","v":""},""]
[null,null,null,null,null,"",{"$f":"IF(C12<>\"\",IF(AND(E12=MIN( IF( $F$4:$F$23=F12, $E$4:$E$23)),E12>0),1,0),\"\")","v":""},""]
[null,null,null,null,null,"",{"$f":"IF(C13<>\"\",IF(AND(E13=MIN( IF( $F$4:$F$23=F13, $E$4:$E$23)),E13>0),1,0),\"\")","v":""},""]
[null,null,null,null,null,"",{"$f":"IF(C14<>\"\",IF(AND(E14=MIN( IF( $F$4:$F$23=F14, $E$4:$E$23)),E14>0),1,0),\"\")","v":""},""]
[null,null,null,null,null,"",{"$f":"IF(C15<>\"\",IF(AND(E15=MIN( IF( $F$4:$F$23=F15, $E$4:$E$23)),E15>0),1,0),\"\")","v":""},""]
[null,null,null,null,null,"",{"$f":"IF(C16<>\"\",IF(AND(E16=MIN( IF( $F$4:$F$23=F16, $E$4:$E$23)),E16>0),1,0),\"\")","v":""},""]
[null,null,null,null,null,"",{"$f":"IF(C17<>\"\",IF(AND(E17=MIN( IF( $F$4:$F$23=F17, $E$4:$E$23)),E17>0),1,0),\"\")","v":""},""]
[null,null,null,null,null,"",{"$f":"IF(C18<>\"\",IF(AND(E18=MIN( IF( $F$4:$F$23=F18, $E$4:$E$23)),E18>0),1,0),\"\")","v":""},""]
[null,null,null,null,null,"",{"$f":"IF(C19<>\"\",IF(AND(E19=MIN( IF( $F$4:$F$23=F19, $E$4:$E$23)),E19>0),1,0),\"\")","v":""},""]
[null,null,null,null,null,"",{"$f":"IF(C20<>\"\",IF(AND(E20=MIN( IF( $F$4:$F$23=F20, $E$4:$E$23)),E20>0),1,0),\"\")","v":""},""]
[null,null,null,null,null,"",{"$f":"IF(C21<>\"\",IF(AND(E21=MIN( IF( $F$4:$F$23=F21, $E$4:$E$23)),E21>0),1,0),\"\")","v":""},""]
[null,null,null,null,null,"",{"$f":"IF(C22<>\"\",IF(AND(E22=MIN( IF( $F$4:$F$23=F22, $E$4:$E$23)),E22>0),1,0),\"\")","v":""},""]
[null,null,null,null,null,"",{"$f":"IF(C23<>\"\",IF(AND(E23=MIN( IF( $F$4:$F$23=F23, $E$4:$E$23)),E23>0),1,0),\"\")","v":""},""]
[]
[null,"Driver","Lane","Slowest Lap Time","Fastest Lap Time","Average Lap Time","Total Laps"]

{"sheet":"Round 5","index":5,"n_rows":25,"n_cols":8,"rows_kept":25,"cut":false,"hidden":false,"merged":[[1,1,1,7]]}
[]
[null,{"$f":"SeriesName & \" - Round 5\"","v":"2017 Group C / IMSA - Round 5"}]
[null,"Position","Driver","Laps","Fastest Lap","Group","Fastest Lap Bonus","Points"]
[null,null,null,null,null,{"$f":"IF(ISNA(VLOOKUP(C4,SeriesSummary,Group,FALSE)),\"\",VLOOKUP(C4,SeriesSummary,Group,FALSE))","v":""},{"$f":"IF(C4<>\"\",IF(AND(E4=MIN( IF( $F$4:$F$23=F4, $E$4:$E$23)),E4>0),1,0),\"\")","v":""},{"$f":"IF(ISNA(VLOOKUP(B4,Points,2,FALSE)),\"\",VLOOKUP(B4,Points,2,FALSE)+G4)","v":""}]
[null,null,null,null,null,"",{"$f":"IF(C5<>\"\",IF(AND(E5=MIN( IF( $F$4:$F$23=F5, $E$4:$E$23)),E5>0),1,0),\"\")","v":""},""]
[null,null,null,null,null,"",{"$f":"IF(C6<>\"\",IF(AND(E6=MIN( IF( $F$4:$F$23=F6, $E$4:$E$23)),E6>0),1,0),\"\")","v":""},""]
[null,null,null,null,null,"",{"$f":"IF(C7<>\"\",IF(AND(E7=MIN( IF( $F$4:$F$23=F7, $E$4:$E$23)),E7>0),1,0),\"\")","v":""},""]
[null,null,null,null,null,"",{"$f":"IF(C8<>\"\",IF(AND(E8=MIN( IF( $F$4:$F$23=F8, $E$4:$E$23)),E8>0),1,0),\"\")","v":""},""]
[null,null,null,null,null,"",{"$f":"IF(C9<>\"\",IF(AND(E9=MIN( IF( $F$4:$F$23=F9, $E$4:$E$23)),E9>0),1,0),\"\")","v":""},""]
[null,null,null,null,null,"",{"$f":"IF(C10<>\"\",IF(AND(E10=MIN( IF( $F$4:$F$23=F10, $E$4:$E$23)),E10>0),1,0),\"\")","v":""},""]
[null,null,null,null,null,"",{"$f":"IF(C11<>\"\",IF(AND(E11=MIN( IF( $F$4:$F$23=F11, $E$4:$E$23)),E11>0),1,0),\"\")","v":""},""]
[null,null,null,null,null,"",{"$f":"IF(C12<>\"\",IF(AND(E12=MIN( IF( $F$4:$F$23=F12, $E$4:$E$23)),E12>0),1,0),\"\")","v":""},""]
[null,null,null,null,null,"",{"$f":"IF(C13<>\"\",IF(AND(E13=MIN( IF( $F$4:$F$23=F13, $E$4:$E$23)),E13>0),1,0),\"\")","v":""},""]
[null,null,null,null,null,"",{"$f":"IF(C14<>\"\",IF(AND(E14=MIN( IF( $F$4:$F$23=F14, $E$4:$E$23)),E14>0),1,0),\"\")","v":""},""]
[null,null,null,null,null,"",{"$f":"IF(C15<>\"\",IF(AND(E15=MIN( IF( $F$4:$F$23=F15, $E$4:$E$23)),E15>0),1,0),\"\")","v":""},""]
[null,null,null,null,null,"",{"$f":"IF(C16<>\"\",IF(AND(E16=MIN( IF( $F$4:$F$23=F16, $E$4:$E$23)),E16>0),1,0),\"\")","v":""},""]
[null,null,null,null,null,"",{"$f":"IF(C17<>\"\",IF(AND(E17=MIN( IF( $F$4:$F$23=F17, $E$4:$E$23)),E17>0),1,0),\"\")","v":""},""]
[null,null,null,null,null,"",{"$f":"IF(C18<>\"\",IF(AND(E18=MIN( IF( $F$4:$F$23=F18, $E$4:$E$23)),E18>0),1,0),\"\")","v":""},""]
[null,null,null,null,null,"",{"$f":"IF(C19<>\"\",IF(AND(E19=MIN( IF( $F$4:$F$23=F19, $E$4:$E$23)),E19>0),1,0),\"\")","v":""},""]
[null,null,null,null,null,"",{"$f":"IF(C20<>\"\",IF(AND(E20=MIN( IF( $F$4:$F$23=F20, $E$4:$E$23)),E20>0),1,0),\"\")","v":""},""]
[null,null,null,null,null,"",{"$f":"IF(C21<>\"\",IF(AND(E21=MIN( IF( $F$4:$F$23=F21, $E$4:$E$23)),E21>0),1,0),\"\")","v":""},""]
[null,null,null,null,null,"",{"$f":"IF(C22<>\"\",IF(AND(E22=MIN( IF( $F$4:$F$23=F22, $E$4:$E$23)),E22>0),1,0),\"\")","v":""},""]
[null,null,null,null,null,"",{"$f":"IF(C23<>\"\",IF(AND(E23=MIN( IF( $F$4:$F$23=F23, $E$4:$E$23)),E23>0),1,0),\"\")","v":""},""]
[]
[null,"Driver","Lane","Slowest Lap Time","Fastest Lap Time","Average Lap Time","Total Laps"]

{"sheet":"Round 6","index":6,"n_rows":25,"n_cols":8,"rows_kept":25,"cut":false,"hidden":false,"merged":[[1,1,1,7]]}
[]
[null,{"$f":"SeriesName & \" - Round 6\"","v":"2017 Group C / IMSA - Round 6"}]
[null,"Position","Driver","Laps","Fastest Lap","Group","Fastest Lap Bonus","Points"]
[null,null,null,null,null,{"$f":"IF(ISNA(VLOOKUP(C4,SeriesSummary,Group,FALSE)),\"\",VLOOKUP(C4,SeriesSummary,Group,FALSE))","v":""},{"$f":"IF(C4<>\"\",IF(AND(E4=MIN( IF( $F$4:$F$23=F4, $E$4:$E$23)),E4>0),1,0),\"\")","v":""},{"$f":"IF(ISNA(VLOOKUP(B4,Points,2,FALSE)),\"\",VLOOKUP(B4,Points,2,FALSE)+G4)","v":""}]
[null,null,null,null,null,"",{"$f":"IF(C5<>\"\",IF(AND(E5=MIN( IF( $F$4:$F$23=F5, $E$4:$E$23)),E5>0),1,0),\"\")","v":""},""]
[null,null,null,null,null,"",{"$f":"IF(C6<>\"\",IF(AND(E6=MIN( IF( $F$4:$F$23=F6, $E$4:$E$23)),E6>0),1,0),\"\")","v":""},""]
[null,null,null,null,null,"",{"$f":"IF(C7<>\"\",IF(AND(E7=MIN( IF( $F$4:$F$23=F7, $E$4:$E$23)),E7>0),1,0),\"\")","v":""},""]
[null,null,null,null,null,"",{"$f":"IF(C8<>\"\",IF(AND(E8=MIN( IF( $F$4:$F$23=F8, $E$4:$E$23)),E8>0),1,0),\"\")","v":""},""]
[null,null,null,null,null,"",{"$f":"IF(C9<>\"\",IF(AND(E9=MIN( IF( $F$4:$F$23=F9, $E$4:$E$23)),E9>0),1,0),\"\")","v":""},""]
[null,null,null,null,null,"",{"$f":"IF(C10<>\"\",IF(AND(E10=MIN( IF( $F$4:$F$23=F10, $E$4:$E$23)),E10>0),1,0),\"\")","v":""},""]
[null,null,null,null,null,"",{"$f":"IF(C11<>\"\",IF(AND(E11=MIN( IF( $F$4:$F$23=F11, $E$4:$E$23)),E11>0),1,0),\"\")","v":""},""]
[null,null,null,null,null,"",{"$f":"IF(C12<>\"\",IF(AND(E12=MIN( IF( $F$4:$F$23=F12, $E$4:$E$23)),E12>0),1,0),\"\")","v":""},""]
[null,null,null,null,null,"",{"$f":"IF(C13<>\"\",IF(AND(E13=MIN( IF( $F$4:$F$23=F13, $E$4:$E$23)),E13>0),1,0),\"\")","v":""},""]
[null,null,null,null,null,"",{"$f":"IF(C14<>\"\",IF(AND(E14=MIN( IF( $F$4:$F$23=F14, $E$4:$E$23)),E14>0),1,0),\"\")","v":""},""]
[null,null,null,null,null,"",{"$f":"IF(C15<>\"\",IF(AND(E15=MIN( IF( $F$4:$F$23=F15, $E$4:$E$23)),E15>0),1,0),\"\")","v":""},""]
[null,null,null,null,null,"",{"$f":"IF(C16<>\"\",IF(AND(E16=MIN( IF( $F$4:$F$23=F16, $E$4:$E$23)),E16>0),1,0),\"\")","v":""},""]
[null,null,null,null,null,"",{"$f":"IF(C17<>\"\",IF(AND(E17=MIN( IF( $F$4:$F$23=F17, $E$4:$E$23)),E17>0),1,0),\"\")","v":""},""]
[null,null,null,null,null,"",{"$f":"IF(C18<>\"\",IF(AND(E18=MIN( IF( $F$4:$F$23=F18, $E$4:$E$23)),E18>0),1,0),\"\")","v":""},""]
[null,null,null,null,null,"",{"$f":"IF(C19<>\"\",IF(AND(E19=MIN( IF( $F$4:$F$23=F19, $E$4:$E$23)),E19>0),1,0),\"\")","v":""},""]
[null,null,null,null,null,"",{"$f":"IF(C20<>\"\",IF(AND(E20=MIN( IF( $F$4:$F$23=F20, $E$4:$E$23)),E20>0),1,0),\"\")","v":""},""]
[null,null,null,null,null,"",{"$f":"IF(C21<>\"\",IF(AND(E21=MIN( IF( $F$4:$F$23=F21, $E$4:$E$23)),E21>0),1,0),\"\")","v":""},""]
[null,null,null,null,null,"",{"$f":"IF(C22<>\"\",IF(AND(E22=MIN( IF( $F$4:$F$23=F22, $E$4:$E$23)),E22>0),1,0),\"\")","v":""},""]
[null,null,null,null,null,"",{"$f":"IF(C23<>\"\",IF(AND(E23=MIN( IF( $F$4:$F$23=F23, $E$4:$E$23)),E23>0),1,0),\"\")","v":""},""]
[]
[null,"Driver","Lane","Slowest Lap Time","Fastest Lap Time","Average Lap Time","Total Laps"]

{"sheet":"SumSheet","index":7,"n_rows":64,"n_cols":80,"rows_kept":64,"cut":false,"hidden":false,"merged":[[6,53,6,63],[6,64,6,67],[6,68,6,71],[6,72,6,79],[42,1,42,2],[6,1,7,1],[6,3,6,8],[6,9,6,19],[6,20,6,30],[6,31,6,41],[6,42,6,52],[6,2,7,2]]}
[]
[]
[]
[]
[]
[null,1,{"$f":"B6+1","v":2},{"$f":"C6+1","v":3},4,5,6,7,8,9,10,11,12,13,14,15,16,17,18,19,20,21,22,23,24,25,26,27,28,29,30,31,32,33,34,35,36,37,38,39,40,41,42,43,44,45,46,47,48,49,50,51,52,53,54,55,56,57,58,59,60,61,62,63,64,65,66,{"$f":"BO6+1","v":67},68,69,70,71,72,73,74,75,76,77,78,79]
[null,"Racer","Group","Round 1",null,null,null,null,null,"Round 2",null,null,null,null,null,null,null,null,null,null,"Round 3",null,null,null,null,null,null,null,null,null,null,"Round 4",null,null,null,null,null,null,null,null,null,null,"Round 5",null,null,null,null,null,null,null,null,null,null,"Round 6",null,null,null,null,null,null,null,null,null,null,"Total",null,null,null,"Dropped Round",null,null,null,"Final Classification"]
[null,null,null,"Laps","Points","Fastest Lap","Total Round Points","Class Rank","Rank","Laps","Points","Fastest Lap","Total Round Points","Running Series Points","Class Rank","Running Class Rank","Change in Class Rank","Overall Rank","Running Overall Rank","Change in Overall Rank","Laps","Points","Fastest Lap","Total Round Points","Running Series Points","Class Rank","Running Class Rank","Change in Class Rank","Overall Rank","Running Overall Rank","Change in Overall Rank","Laps","Points","Fastest Lap","Total Round Points","Running Series Points","Class Rank","Running Class Rank","Change in Class Rank","Overall Rank","Running Overall Rank","Change in Overall Rank","Laps","Points","Fastest Lap","Total Round Points","Running Series Points","Class Rank","Running Class Rank","Change in Class Rank","Overall Rank","Running Overall Rank","Change in Overall Rank","Laps","Points","Fastest Lap","Total Round Points","Running Series Points","Class Rank","Running Class Rank","Change in Class Rank","Overall Rank","Running Overall Rank","Change in Overall Rank","Rounds Run","Points","Fastest Laps","Laps","Round","Points","Fastest Laps","Laps","Points","Fastest Laps","Total Points","Laps","Class Rank","Change in Class Rank","Overall Rank","Change in Overall Rank"]
[null,"Alejandro G.","A",{"$f":"IF(ISNA(VLOOKUP($B9,Round1Results,2,FALSE)),0,VLOOKUP($B9,Round1Results,2,FALSE))","v":208.3},{"$f":"IF(ISNA(VLOOKUP($B9,Round1Results,6,FALSE)),0,VLOOKUP($B9,Round1Results,6,FALSE)-F9)","v":16},{"$f":"IF(ISNA(VLOOKUP($B9,Round1Results,5,FALSE)),0,VLOOKUP($B9,Round1Results,5,FALSE))","v":0},{"$f":"SUM(E9:F9)","v":16},{"$f":"IF($BP9>0,SUMPRODUCT(--(C9=C$9:C$38),--(G9<(G$9:G$38)))+1,0)","v":5},{"$f":"IF($BP9>0,RANK(G9,G$9:G$38),0)","v":5},{"$f":"IF(ISNA(VLOOKUP($B9,Round2Results,2,FALSE)),0,VLOOKUP($B9,Round2Results,2,FALSE))","v":214.01},{"$f":"IF(ISNA(VLOOKUP($B9,Round2Results,6,FALSE)),0,VLOOKUP($B9,Round2Results,6,FALSE)-L9)","v":15},{"$f":"IF(ISNA(VLOOKUP($B9,Round2Results,5,FALSE)),0,VLOOKUP($B9,Round2Results,5,FALSE))","v":0},{"$f":"SUM(K9:L9)","v":15},{"$f":"G9+M9","v":31},{"$f":"IF(J9>0,SUMPRODUCT(--($C9=$C$9:$C$38),--(M9<(M$9:M$38)))+1,0)","v":6},{"$f":"IF($BP9>0,SUMPRODUCT(--($C9=$C$9:$C$38),--(N9<(N$9:N$38)))+1,0)","v":4},{"$f":"IF(H9=0,0,H9-P9)","v":1},{"$f":"IF(J9>0,RANK(M9,M$9:M$38),0)","v":6},{"$f":"IF($BP9>0,RANK(N9,N$9:N$38),0)","v":4},{"$f":"IF(I9=0,0,I9-S9)","v":1},{"$f":"IF(ISNA(VLOOKUP($B9,Round3Results,2,FALSE)),0,VLOOKUP($B9,Round3Results,2,FALSE))","v":212.36},{"$f":"IF(ISNA(VLOOKUP($B9,Round3Results,6,FALSE)),0,VLOOKUP($B9,Round3Results,6,FALSE)-W9)","v":15},{"$f":"IF(ISNA(VLOOKUP($B9,Round3Results,5,FALSE)),0,VLOOKUP($B9,Round3Results,5,FALSE))","v":0},{"$f":"SUM(V9:W9)","v":15},{"$f":"N9+X9","v":46},{"$f":"IF(U9>0,SUMPRODUCT(--($C9=$C$9:$C$38),--(X9<(X$9:X$38)))+1,0)","v":5},{"$f":"IF($BP9>0,SUMPRODUCT(--($C9=$C$9:$C$38),--(Y9<(Y$9:Y$38)))+1,0)","v":5},{"$f":"IF(P9=0,0,P9-AA9)","v":-1},{"$f":"IF(U9>0,RANK(X9,X$9:X$38),0)","v":6},{"$f":"IF($BP9>0,RANK(Y9,Y$9:Y$38),0)","v":6},{"$f":"IF(S9=0,0,S9-AD9)","v":-2},{"$f":"IF(ISNA(VLOOKUP($B9,Round4Results,2,FALSE)),0,VLOOKUP($B9,Round4Results,2,FALSE))","v":0},{"$f":"IF(ISNA(VLOOKUP($B9,Round4Results,6,FALSE)),0,VLOOKUP($B9,Round4Results,6,FALSE)-AH9)","v":0},{"$f":"IF(ISNA(VLOOKUP($B9,Round4Results,5,FALSE)),0,VLOOKUP($B9,Round4Results,5,FALSE))","v":0},{"$f":"SUM(AG9:AH9)","v":0},{"$f":"Y9+AI9","v":46},{"$f":"IF(AF9>0,SUMPRODUCT(--($C9=$C$9:$C$38),--(AI9<(AI$9:AI$38)))+1,0)","v":0},{"$f":"IF($BP9>0,SUMPRODUCT(--($C9=$C$9:$C$38),--(AJ9<(AJ$9:AJ$38)))+1,0)","v":5},{"$f":"IF(AA9=0,0,AA9-AL9)","v":0},{"$f":"IF(AF9>0,RANK(AI9,AI$9:AI$38),0)","v":0},{"$f":"IF($BP9>0,RANK(AJ9,AJ$9:AJ$38),0)","v":6},{"$f":"IF(AD9=0,0,AD9-AO9)","v":0},{"$f":"IF(ISNA(VLOOKUP($B9,Round5Results,2,FALSE)),0,VLOOKUP($B9,Round5Results,2,FALSE))","v":0},{"$f":"IF(ISNA(VLOOKUP($B9,Round5Results,6,FALSE)),0,VLOOKUP($B9,Round5Results,6,FALSE)-AS9)","v":0},{"$f":"IF(ISNA(VLOOKUP($B9,Round5Results,5,FALSE)),0,VLOOKUP($B9,Round5Results,5,FALSE))","v":0},{"$f":"SUM(AR9:AS9)","v":0},{"$f":"AJ9+AT9","v":46},{"$f":"IF(AQ9>0,SUMPRODUCT(--($C9=$C$9:$C$38),--(AT9<(AT$9:AT$38)))+1,0)","v":0},{"$f":"IF($BP9>0,SUMPRODUCT(--($C9=$C$9:$C$38),--(AU9<(AU$9:AU$38)))+1,0)","v":5},{"$f":"IF(AL9=0,0,AL9-AW9)","v":0},{"$f":"IF(AQ9>0,RANK(AT9,AT$9:AT$38),0)","v":0},{"$f":"IF($BP9>0,RANK(AU9,AU$9:AU$38),0)","v":6},{"$f":"IF(AO9=0,0,AO9-AZ9)","v":0},{"$f":"IF(ISNA(VLOOKUP($B9,Round6Results,2,FALSE)),0,VLOOKUP($B9,Round6Results,2,FALSE))","v":0},{"$f":"IF(ISNA(VLOOKUP($B9,Round6Results,6,FALSE)),0,VLOOKUP($B9,Round6Results,6,FALSE)-BD9)","v":0},{"$f":"IF(ISNA(VLOOKUP($B9,Round6Results,5,FALSE)),0,VLOOKUP($B9,Round6Results,5,FALSE))","v":0},{"$f":"SUM(BC9:BD9)","v":0},{"$f":"AU9+BE9","v":46},{"$f":"IF(BB9>0,SUMPRODUCT(--($C9=$C$9:$C$38),--(BE9<(BE$9:BE$38)))+1,0)","v":0},{"$f":"IF($BP9>0,SUMPRODUCT(--($C9=$C$9:$C$38),--(BF9<(BF$9:BF$38)))+1,0)","v":5},{"$f":"IF(AW9=0,0,AW9-BH9)","v":0},{"$f":"IF(BB9>0,RANK(BE9,BE$9:BE$38),0)","v":0},{"$f":"IF($BP9>0,RANK(BF9,BF$9:BF$38),0)","v":6},{"$f":"IF(AZ9=0,0,AZ9-BK9)","v":0},{"$f":"COUNTIF(D9,\">0\")+COUNTIF(J9,\">0\")+COUNTIF(U9,\">0\")+COUNTIF(AF9,\">0\")+COUNTIF(AQ9,\">0\")+COUNTIF(BB9,\">0\")","v":3},{"$f":"E9+K9+V9+AG9+AR9+BC9","v":46},0,{"$f":"D9+J9+U9+AF9+AQ9+BB9","v":634.67000000000007},null,{"$f":"IF($BQ9=1,E9,IF($BQ9=2,K9,IF($BQ9=3,V9,IF($BQ9=4,AG9,IF($BQ9=5,AR9,IF($BQ9=6,BC9,0))))))","v":0},{"$f":"IF($BQ9=1,F9,IF($BQ9=2,L9,IF($BQ9=3,W9,IF($BQ9=4,AH9,IF($BQ9=5,AS9,IF($BQ9=6,BD9,0))))))","v":0},{"$f":"IF($BQ$9=1,D9,IF($BQ9=2,J9,IF($BQ9=3,U9,IF($BQ9=4,AF9,IF($BQ9=5,AP9,IF($BQ9=6,BB9,0))))))","v":0},{"$f":"E9+K9+V9+AG9+AR9+BC9-BR9","v":46},0,{"$f":"BU9+BV9","v":46},{"$f":"D9+J9+U9+AF9+AQ9+BB9-BT9","v":634.67000000000007},{"$f":"IF($BW9>0,(SUMPRODUCT(($C9=Group_Range)*($BW9<(Total_Point_Range)))+1)+SUMPRODUCT(($C9=Group_Range)*(Total_Point_Range=$BW9)*(Total_Lap_Range>$BX9)),0)","v":5},{"$f":"IF(AND(B9<>\"\",RoundsRun>1),IF(IF(RoundsRun=2,VLOOKUP(B9,SeriesSummary,Round2ClassRankChange,FALSE),IF(RoundsRun=3,VLOOKUP(B9,SeriesSummary,Round3ClassRankChange,FALSE),IF(RoundsRun=4,VLOOKUP(B9,SeriesSummary,Round4ClassRankChange,FALSE),IF(RoundsRun=5,VLOOKUP(B9,SeriesSummary,Round5ClassRankChange,FALSE),IF(RoundsRun=6,VLOOKUP(B9,SeriesSummary,Round6ClassRankChange,FALSE),\"-\")))))>0,\"+\"&IF(RoundsRun=2,VLOOKUP(B9,SeriesSummary,Round2ClassRankChange,FALSE),IF(RoundsRun=3,VLOOKUP(B9,SeriesSummary,Round3ClassRankChange,FALSE),IF(RoundsRun=4,VLOOKUP(B9,SeriesSummary,Round4ClassRankChange,FALSE),IF(RoundsRun=5,VLOOKUP(B9,SeriesSummary,Round5ClassRankChange,FALSE),IF(RoundsRun=6,VLOOKUP(B9,SeriesSummary,Round6ClassRankChange,FALSE),\"-\"))))),IF((IF(RoundsRun=2,VLOOKUP(B9,SeriesSummary,Round2ClassRankChange,FALSE),IF(RoundsRun=3,VLOOKUP(B9,SeriesSummary,Round3ClassRankChange,FALSE),IF(RoundsRun=4,VLOOKUP(B9,SeriesSummary,Round4ClassRankChange,FALSE),IF(RoundsRun=5,VLOOKUP(B9,SeriesSummary,Round5ClassRankChange,FALSE),IF(RoundsRun=6,VLOOKUP(B9,SeriesSummary,Round6ClassRankChange,FALSE),\"-\"))))))=0,\"-\",(IF(RoundsRun=2,VLOOKUP(B9,SeriesSummary,Round2ClassRankChange,FALSE),IF(RoundsRun=3,VLOOKUP(B9,SeriesSummary,Round3ClassRankChange,FALSE),IF(RoundsRun=4,VLOOKUP(B9,SeriesSummary,Round4ClassRankChange,FALSE),IF(RoundsRun=5,VLOOKUP(B9,SeriesSummary,Round5ClassRankChange,FALSE),IF(RoundsRun=6,VLOOKUP(B9,SeriesSummary,Round6ClassRankChange,FALSE),\"-\")))))))),\"-\")","v":-1},{"$f":"IF(BM9>0,RANK(BW9,Total_Point_Range)+SUMPRODUCT((Total_Point_Range=BW9)*(Total_Lap_Range>BX9)),0)","v":6},{"$f":"IF(AND(B9<>\"\",RoundsRun>1),IF(IF(RoundsRun=2,VLOOKUP(B9,SeriesSummary,Round2RankChange,FALSE),IF(RoundsRun=3,VLOOKUP(B9,SeriesSummary,Round3RankChange,FALSE),IF(RoundsRun=4,VLOOKUP(B9,SeriesSummary,Round4RankChange,FALSE),IF(RoundsRun=5,VLOOKUP(B9,SeriesSummary,Round5RankChange,FALSE),IF(RoundsRun=6,VLOOKUP(B9,SeriesSummary,Round6RankChange,FALSE),\"-\")))))>0,\"+\"&IF(RoundsRun=2,VLOOKUP(B9,SeriesSummary,Round2RankChange,FALSE),IF(RoundsRun=3,VLOOKUP(B9,SeriesSummary,Round3RankChange,FALSE),IF(RoundsRun=4,VLOOKUP(B9,SeriesSummary,Round4RankChange,FALSE),IF(RoundsRun=5,VLOOKUP(B9,SeriesSummary,Round5RankChange,FALSE),IF(RoundsRun=6,VLOOKUP(B9,SeriesSummary,Round6RankChange,FALSE),\"-\"))))),IF((IF(RoundsRun=2,VLOOKUP(B9,SeriesSummary,Round2RankChange,FALSE),IF(RoundsRun=3,VLOOKUP(B9,SeriesSummary,Round3RankChange,FALSE),IF(RoundsRun=4,VLOOKUP(B9,SeriesSummary,Round4RankChange,FALSE),IF(RoundsRun=5,VLOOKUP(B9,SeriesSummary,Round5RankChange,FALSE),IF(RoundsRun=6,VLOOKUP(B9,SeriesSummary,Round6RankChange,FALSE),\"-\"))))))=0,\"-\",(IF(RoundsRun=2,VLOOKUP(B9,SeriesSummary,Round2RankChange,FALSE),IF(RoundsRun=3,VLOOKUP(B9,SeriesSummary,Round3RankChange,FALSE),IF(RoundsRun=4,VLOOKUP(B9,SeriesSummary,Round4RankChange,FALSE),IF(RoundsRun=5,VLOOKUP(B9,SeriesSummary,Round5RankChange,FALSE),IF(RoundsRun=6,VLOOKUP(B9,SeriesSummary,Round6RankChange,FALSE),\"-\")))))))),\"-\")","v":-2}]
[null,"Ary B.","A",219.27,19,1,20,{"$f":"IF($BP10>0,SUMPRODUCT(--(C10=C$9:C$38),--(G10<(G$9:G$38)))+1,0)","v":1},{"$f":"IF($BP10>0,RANK(G10,G$9:G$38),0)","v":1},227.4,20,1,{"$f":"SUM(K10:L10)","v":21},{"$f":"G10+M10","v":41},{"$f":"IF(J10>0,SUMPRODUCT(--($C10=$C$9:$C$38),--(M10<(M$9:M$38)))+1,0)","v":1},{"$f":"IF($BP10>0,SUMPRODUCT(--($C10=$C$9:$C$38),--(N10<(N$9:N$38)))+1,0)","v":1},{"$f":"IF(H10=0,0,H10-P10)","v":0},{"$f":"IF(J10>0,RANK(M10,M$9:M$38),0)","v":1},{"$f":"IF($BP10>0,RANK(N10,N$9:N$38),0)","v":1},{"$f":"IF(I10=0,0,I10-S10)","v":0},225.75,20,0,20,{"$f":"N10+X10","v":61},{"$f":"IF(U10>0,SUMPRODUCT(--($C10=$C$9:$C$38),--(X10<(X$9:X$38)))+1,0)","v":1},{"$f":"IF($BP10>0,SUMPRODUCT(--($C10=$C$9:$C$38),--(Y10<(Y$9:Y$38)))+1,0)","v":1},{"$f":"IF(P10=0,0,P10-AA10)","v":0},{"$f":"IF(U10>0,RANK(X10,X$9:X$38),0)","v":1},{"$f":"IF($BP10>0,RANK(Y10,Y$9:Y$38),0)","v":1},{"$f":"IF(S10=0,0,S10-AD10)","v":0},0,0,0,0,{"$f":"Y10+AI10","v":61},{"$f":"IF(AF10>0,SUMPRODUCT(--($C10=$C$9:$C$38),--(AI10<(AI$9:AI$38)))+1,0)","v":0},{"$f":"IF($BP10>0,SUMPRODUCT(--($C10=$C$9:$C$38),--(AJ10<(AJ$9:AJ$38)))+1,0)","v":1},{"$f":"IF(AA10=0,0,AA10-AL10)","v":0},{"$f":"IF(AF10>0,RANK(AI10,AI$9:AI$38),0)","v":0},{"$f":"IF($BP10>0,RANK(AJ10,AJ$9:AJ$38),0)","v":1},{"$f":"IF(AD10=0,0,AD10-AO10)","v":0},0,0,0,0,{"$f":"AJ10+AT10","v":61},{"$f":"IF(AQ10>0,SUMPRODUCT(--($C10=$C$9:$C$38),--(AT10<(AT$9:AT$38)))+1,0)","v":0},{"$f":"IF($BP10>0,SUMPRODUCT(--($C10=$C$9:$C$38),--(AU10<(AU$9:AU$38)))+1,0)","v":1},{"$f":"IF(AL10=0,0,AL10-AW10)","v":0},{"$f":"IF(AQ10>0,RANK(AT10,AT$9:AT$38),0)","v":0},{"$f":"IF($BP10>0,RANK(AU10,AU$9:AU$38),0)","v":1},{"$f":"IF(AO10=0,0,AO10-AZ10)","v":0},0,0,0,0,{"$f":"AU10+BE10","v":61},{"$f":"IF(BB10>0,SUMPRODUCT(--($C10=$C$9:$C$38),--(BE10<(BE$9:BE$38)))+1,0)","v":0},{"$f":"IF($BP10>0,SUMPRODUCT(--($C10=$C$9:$C$38),--(BF10<(BF$9:BF$38)))+1,0)","v":1},{"$f":"IF(AW10=0,0,AW10-BH10)","v":0},{"$f":"IF(BB10>0,RANK(BE10,BE$9:BE$38),0)","v":0},{"$f":"IF($BP10>0,RANK(BF10,BF$9:BF$38),0)","v":1},{"$f":"IF(AZ10=0,0,AZ10-BK10)","v":0},3,59,2,672.42000000000007,null,{"$f":"IF($BQ10=1,E10,IF($BQ10=2,K10,IF($BQ10=3,V10,IF($BQ10=4,AG10,IF($BQ10=5,AR10,IF($BQ10=6,BC10,0))))))","v":0},{"$f":"IF($BQ10=1,F10,IF($BQ10=2,L10,IF($BQ10=3,W10,IF($BQ10=4,AH10,IF($BQ10=5,AS10,IF($BQ10=6,BD10,0))))))","v":0},{"$f":"IF($BQ$9=1,D10,IF($BQ10=2,J10,IF($BQ10=3,U10,IF($BQ10=4,AF10,IF($BQ10=5,AP10,IF($BQ10=6,BB10,0))))))","v":0},59,2,{"$f":"BU10+BV10","v":61},672.42000000000007,1,"-",1,"-"]
[null,"Austin C.","B",0,0,0,{"$f":"SUM(E11:F11)","v":0},0,0,0,0,0,0,0,0,0,0,0,0,0,0,0,0,{"$f":"SUM(V11:W11)","v":0},0,0,0,0,0,0,0,0,0,0,{"$f":"SUM(AG11:AH11)","v":0},0,0,0,0,0,0,0,0,0,0,{"$f":"SUM(AR11:AS11)","v":0},0,0,0,0,0,0,0,0,0,0,{"$f":"SUM(BC11:BD11)","v":0},0,0,0,0,0,0,0,0,0,0,0,null,{"$f":"IF($BQ11=1,E11,IF($BQ11=2,K11,IF($BQ11=3,V11,IF($BQ11=4,AG11,IF($BQ11=5,AR11,IF($BQ11=6,BC11,0))))))","v":0},{"$f":"IF($BQ11=1,F11,IF($BQ11=2,L11,IF($BQ11=3,W11,IF($BQ11=4,AH11,IF($BQ11=5,AS11,IF($BQ11=6,BD11,0))))))","v":0},0,0,0,0,0,0,"-",0,"-"]
[null,"Bob L.","B",0,0,0,0,0,0,0,0,0,0,0,0,0,0,0,0,0,0,0,0,0,0,0,0,0,0,0,0,0,0,0,0,0,0,0,0,0,0,0,0,0,0,0,0,0,0,0,0,0,0,0,0,0,0,0,0,0,0,0,0,0,0,0,0,0,null,0,0,0,0,0,0,0,0,"-",0,"-"]
[null,"Brett L.","B",184.85,7,0,7,5,14,205.75,11,0,11,18,2,3,2,10,12,2,207.76,11,0,11,29,2,2,1,10,11,1,0,0,0,0,29,0,2,0,0,11,0,0,0,0,0,29,0,2,0,0,11,0,0,0,0,0,29,0,2,0,0,11,0,3,29,0,598.36,null,0,0,0,29,0,29,598.36,3,"+1",12,"+1"]
[null,"Brian H.","A",0,0,0,0,0,0,0,0,0,0,0,0,0,0,0,0,0,0,0,0,0,0,0,0,0,0,0,0,0,0,0,0,0,0,0,0,0,0,0,0,0,0,0,0,0,0,0,0,0,0,0,0,0,0,0,0,0,0,0,0,0,0,0,0,0,null,0,0,0,0,0,0,0,0,"-",0,"-"]
[null,"David C.","A",199.85,11,0,11,8,10,221.68,18,0,18,29,3,6,2,3,7,3,222.74,19,1,20,49,1,4,2,1,4,3,0,0,0,0,49,0,4,0,0,4,0,0,0,0,0,49,0,4,0,0,4,0,0,0,0,0,49,0,4,0,0,4,0,3,48,1,644.27,null,0,0,0,48,1,49,644.27,4,"+2",4,"+3"]
[null,"John B.","B",198.68,10,0,10,3,11,0,0,0,0,10,0,5,-2,0,14,-3,203.36,8,0,8,18,4,5,0,13,14,0,0,0,0,0,18,0,5,0,0,14,0,0,0,0,0,18,0,5,0,0,14,0,0,0,0,0,18,0,5,0,0,14,0,2,18,0,402.04,null,0,0,0,18,0,18,402.04,5,"-",14,"-"]
[null,"Jordan C.","A",213.44,17,0,17,4,4,215.22,16,0,16,33,5,3,1,5,3,1,213.5,17,0,17,50,4,3,0,4,3,0,0,0,0,0,50,0,3,0,0,3,0,0,0,0,0,50,0,3,0,0,3,0,0,0,0,0,50,0,3,0,0,3,0,3,50,0,642.16,null,0,0,0,50,0,50,642.16,3,"-",3,"-"]
[null,"Kyle M.","B",0,0,0,0,0,0,0,0,0,0,0,0,0,0,0,0,0,0,0,0,0,0,0,0,0,0,0,0,0,0,0,0,0,0,0,0,0,0,0,0,0,0,0,0,0,0,0,0,0,0,0,0,0,0,0,0,0,0,0,0,0,0,0,0,0,null,0,0,0,0,0,0,0,0,"-",0,"-"]
[null,"Mark L.","B",201.83,12,0,12,2,9,200.47,8,0,8,20,5,2,0,13,11,-2,203.37,9,0,9,29,3,2,0,12,11,0,0,0,0,0,29,0,2,0,0,11,0,0,0,0,0,29,0,2,0,0,11,0,0,0,0,0,29,0,2,0,0,11,0,3,29,0,605.67000000000007,null,0,0,0,29,0,29,605.67000000000007,2,"-",11,"-"]
[null,"Marty M.","A",223.35,20,0,20,1,1,223.83,19,0,19,39,2,2,-1,2,2,-1,219.75,18,0,18,57,3,2,0,3,2,0,0,0,0,0,57,0,2,0,0,2,0,0,0,0,0,57,0,2,0,0,2,0,0,0,0,0,57,0,2,0,0,2,0,3,57,0,666.93000000000006,null,0,0,0,57,0,57,666.93000000000006,2,"-",2,"-"]
[null,"Max M.","B",0,0,0,0,0,0,0,0,0,0,0,0,0,0,0,0,0,0,0,0,0,0,0,0,0,0,0,0,0,0,0,0,0,0,0,0,0,0,0,0,0,0,0,0,0,0,0,0,0,0,0,0,0,0,0,0,0,0,0,0,0,0,0,0,0,null,0,0,0,0,0,0,0,0,"-",0,"-"]
[null,"Mitch A.","B",0,0,0,0,6,15,205,10,0,10,10,3,5,1,11,14,1,87,6,0,6,16,6,6,-1,15,15,-1,0,0,0,0,16,0,6,0,0,15,0,0,0,0,0,16,0,6,0,0,15,0,0,0,0,0,16,0,6,0,0,15,0,2,16,0,292,null,0,0,0,16,0,16,292,6,-1,15,-1]
[null,"Nick M.","B",0,0,0,0,0,0,0,0,0,0,0,0,0,0,0,0,0,0,0,0,0,0,0,0,0,0,0,0,0,0,0,0,0,0,0,0,0,0,0,0,0,0,0,0,0,0,0,0,0,0,0,0,0,0,0,0,0,0,0,0,0,0,0,0,0,null,0,0,0,0,0,0,0,0,"-",0,"-"]
[null,"Randy A.","B",197.78,9,0,9,4,12,201.02,9,0,9,18,4,3,1,12,12,0,202.15,7,0,7,25,5,4,-1,14,13,-1,0,0,0,0,25,0,4,0,0,13,0,0,0,0,0,25,0,4,0,0,13,0,0,0,0,0,25,0,4,0,0,13,0,3,25,0,600.95000000000005,null,0,0,0,25,0,25,600.95000000000005,4,-1,13,-1]
[null,"Rich C.","B",205.85,15,1,16,1,5,210.35,13,1,14,30,1,1,0,7,5,0,213.3,16,1,17,47,1,1,0,4,5,0,0,0,0,0,47,0,1,0,0,5,0,0,0,0,0,47,0,1,0,0,5,0,0,0,0,0,47,0,1,0,0,5,0,3,44,3,629.5,null,0,0,0,44,3,47,629.5,1,"-",5,"-"]
[null,"Roy M.","A",205.05,14,0,14,6,7,208.4,12,0,12,26,8,7,-1,9,8,-1,212.13,14,0,14,40,6,6,1,7,7,1,0,0,0,0,40,0,6,0,0,7,0,0,0,0,0,40,0,6,0,0,7,0,0,0,0,0,40,0,6,0,0,7,0,3,40,0,625.58000000000004,null,0,0,0,40,0,40,625.58000000000004,6,"+1",7,"+1"]
[null,"Russell M.","A",216.65,{"$f":"IF(ISNA(VLOOKUP($B27,Round1Results,6,FALSE)),0,VLOOKUP($B27,Round1Results,6,FALSE)-F27)","v":18},0,{"$f":"SUM(E27:F27)","v":18},{"$f":"IF($BP27>0,SUMPRODUCT(--(C27=C$9:C$38),--(G27<(G$9:G$38)))+1,0)","v":3},{"$f":"IF($BP27>0,RANK(G27,G$9:G$38),0)","v":3},194.34,{"$f":"IF(ISNA(VLOOKUP($B27,Round2Results,6,FALSE)),0,VLOOKUP($B27,Round2Results,6,FALSE)-L27)","v":7},0,{"$f":"SUM(K27:L27)","v":7},{"$f":"G27+M27","v":25},{"$f":"IF(J27>0,SUMPRODUCT(--($C27=$C$9:$C$38),--(M27<(M$9:M$38)))+1,0)","v":9},{"$f":"IF($BP27>0,SUMPRODUCT(--($C27=$C$9:$C$38),--(N27<(N$9:N$38)))+1,0)","v":8},{"$f":"IF(H27=0,0,H27-P27)","v":-5},{"$f":"IF(J27>0,RANK(M27,M$9:M$38),0)","v":14},{"$f":"IF($BP27>0,RANK(N27,N$9:N$38),0)","v":9},{"$f":"IF(I27=0,0,I27-S27)","v":-6},210.76,{"$f":"IF(ISNA(VLOOKUP($B27,Round3Results,6,FALSE)),0,VLOOKUP($B27,Round3Results,6,FALSE)-W27)","v":12},0,{"$f":"SUM(V27:W27)","v":12},{"$f":"N27+X27","v":37},{"$f":"IF(U27>0,SUMPRODUCT(--($C27=$C$9:$C$38),--(X27<(X$9:X$38)))+1,0)","v":8},{"$f":"IF($BP27>0,SUMPRODUCT(--($C27=$C$9:$C$38),--(Y27<(Y$9:Y$38)))+1,0)","v":8},{"$f":"IF(P27=0,0,P27-AA27)","v":0},{"$f":"IF(U27>0,RANK(X27,X$9:X$38),0)","v":9},{"$f":"IF($BP27>0,RANK(Y27,Y$9:Y$38),0)","v":9},{"$f":"IF(S27=0,0,S27-AD27)","v":0},0,{"$f":"IF(ISNA(VLOOKUP($B27,Round4Results,6,FALSE)),0,VLOOKUP($B27,Round4Results,6,FALSE)-AH27)","v":0},0,{"$f":"SUM(AG27:AH27)","v":0},{"$f":"Y27+AI27","v":37},{"$f":"IF(AF27>0,SUMPRODUCT(--($C27=$C$9:$C$38),--(AI27<(AI$9:AI$38)))+1,0)","v":0},{"$f":"IF($BP27>0,SUMPRODUCT(--($C27=$C$9:$C$38),--(AJ27<(AJ$9:AJ$38)))+1,0)","v":8},{"$f":"IF(AA27=0,0,AA27-AL27)","v":0},{"$f":"IF(AF27>0,RANK(AI27,AI$9:AI$38),0)","v":0},{"$f":"IF($BP27>0,RANK(AJ27,AJ$9:AJ$38),0)","v":9},{"$f":"IF(AD27=0,0,AD27-AO27)","v":0},0,{"$f":"IF(ISNA(VLOOKUP($B27,Round5Results,6,FALSE)),0,VLOOKUP($B27,Round5Results,6,FALSE)-AS27)","v":0},0,{"$f":"SUM(AR27:AS27)","v":0},{"$f":"AJ27+AT27","v":37},{"$f":"IF(AQ27>0,SUMPRODUCT(--($C27=$C$9:$C$38),--(AT27<(AT$9:AT$38)))+1,0)","v":0},{"$f":"IF($BP27>0,SUMPRODUCT(--($C27=$C$9:$C$38),--(AU27<(AU$9:AU$38)))+1,0)","v":8},{"$f":"IF(AL27=0,0,AL27-AW27)","v":0},{"$f":"IF(AQ27>0,RANK(AT27,AT$9:AT$38),0)","v":0},{"$f":"IF($BP27>0,RANK(AU27,AU$9:AU$38),0)","v":9},{"$f":"IF(AO27=0,0,AO27-AZ27)","v":0},0,{"$f":"IF(ISNA(VLOOKUP($B27,Round6Results,6,FALSE)),0,VLOOKUP($B27,Round6Results,6,FALSE)-BD27)","v":0},0,{"$f":"SUM(BC27:BD27)","v":0},{"$f":"AU27+BE27","v":37},{"$f":"IF(BB27>0,SUMPRODUCT(--($C27=$C$9:$C$38),--(BE27<(BE$9:BE$38)))+1,0)","v":0},{"$f":"IF($BP27>0,SUMPRODUCT(--($C27=$C$9:$C$38),--(BF27<(BF$9:BF$38)))+1,0)","v":8},{"$f":"IF(AW27=0,0,AW27-BH27)","v":0},{"$f":"IF(BB27>0,RANK(BE27,BE$9:BE$38),0)","v":0},{"$f":"IF($BP27>0,RANK(BF27,BF$9:BF$38),0)","v":9},{"$f":"IF(AZ27=0,0,AZ27-BK27)","v":0},{"$f":"COUNTIF(D27,\">0\")+COUNTIF(J27,\">0\")+COUNTIF(U27,\">0\")+COUNTIF(AF27,\">0\")+COUNTIF(AQ27,\">0\")+COUNTIF(BB27,\">0\")","v":3},{"$f":"E27+K27+V27+AG27+AR27+BC27","v":37},{"$f":"F27+L27+W27+AH27+AS27+BD27","v":0},{"$f":"D27+J27+U27+AF27+AQ27+BB27","v":621.75},null,0,0,{"$f":"IF($BQ$9=1,D27,IF($BQ27=2,J27,IF($BQ27=3,U27,IF($BQ27=4,AF27,IF($BQ27=5,AP27,IF($BQ27=6,BB27,0))))))","v":0},{"$f":"E27+K27+V27+AG27+AR27+BC27-BR27","v":37},{"$f":"F27+L27+W27+AH27+AS27+BD27-BS27","v":0},{"$f":"BU27+BV27","v":37},{"$f":"D27+J27+U27+AF27+AQ27+BB27-BT27","v":621.75},8,{"$f":"IF(AND(B27<>\"\",RoundsRun>1),IF(IF(RoundsRun=2,VLOOKUP(B27,SeriesSummary,Round2ClassRankChange,FALSE),IF(RoundsRun=3,VLOOKUP(B27,SeriesSummary,Round3ClassRankChange,FALSE),IF(RoundsRun=4,VLOOKUP(B27,SeriesSummary,Round4ClassRankChange,FALSE),IF(RoundsRun=5,VLOOKUP(B27,SeriesSummary,Round5ClassRankChange,FALSE),IF(RoundsRun=6,VLOOKUP(B27,SeriesSummary,Round6ClassRankChange,FALSE),\"-\")))))>0,\"+\"&IF(RoundsRun=2,VLOOKUP(B27,SeriesSummary,Round2ClassRankChange,FALSE),IF(RoundsRun=3,VLOOKUP(B27,SeriesSummary,Round3ClassRankChange,FALSE),IF(RoundsRun=4,VLOOKUP(B27,SeriesSummary,Round4ClassRankChange,FALSE),IF(RoundsRun=5,VLOOKUP(B27,SeriesSummary,Round5ClassRankChange,FALSE),IF(RoundsRun=6,VLOOKUP(B27,SeriesSummary,Round6ClassRankChange,FALSE),\"-\"))))),IF((IF(RoundsRun=2,VLOOKUP(B27,SeriesSummary,Round2ClassRankChange,FALSE),IF(RoundsRun=3,VLOOKUP(B27,SeriesSummary,Round3ClassRankChange,FALSE),IF(RoundsRun=4,VLOOKUP(B27,SeriesSummary,Round4ClassRankChange,FALSE),IF(RoundsRun=5,VLOOKUP(B27,SeriesSummary,Round5ClassRankChange,FALSE),IF(RoundsRun=6,VLOOKUP(B27,SeriesSummary,Round6ClassRankChange,FALSE),\"-\"))))))=0,\"-\",(IF(RoundsRun=2,VLOOKUP(B27,SeriesSummary,Round2ClassRankChange,FALSE),IF(RoundsRun=3,VLOOKUP(B27,SeriesSummary,Round3ClassRankChange,FALSE),IF(RoundsRun=4,VLOOKUP(B27,SeriesSummary,Round4ClassRankChange,FALSE),IF(RoundsRun=5,VLOOKUP(B27,SeriesSummary,Round5ClassRankChange,FALSE),IF(RoundsRun=6,VLOOKUP(B27,SeriesSummary,Round6ClassRankChange,FALSE),\"-\")))))))),\"-\")","v":"-"},{"$f":"IF(BM27>0,RANK(BW27,Total_Point_Range)+SUMPRODUCT((Total_Point_Range=BW27)*(Total_Lap_Range>BX27)),0)","v":9},{"$f":"IF(AND(B27<>\"\",RoundsRun>1),IF(IF(RoundsRun=2,VLOOKUP(B27,SeriesSummary,Round2RankChange,FALSE),IF(RoundsRun=3,VLOOKUP(B27,SeriesSummary,Round3RankChange,FALSE),IF(RoundsRun=4,VLOOKUP(B27,SeriesSummary,Round4RankChange,FALSE),IF(RoundsRun=5,VLOOKUP(B27,SeriesSummary,Round5RankChange,FALSE),IF(RoundsRun=6,VLOOKUP(B27,SeriesSummary,Round6RankChange,FALSE),\"-\")))))>0,\"+\"&IF(RoundsRun=2,VLOOKUP(B27,SeriesSummary,Round2RankChange,FALSE),IF(RoundsRun=3,VLOOKUP(B27,SeriesSummary,Round3RankChange,FALSE),IF(RoundsRun=4,VLOOKUP(B27,SeriesSummary,Round4RankChange,FALSE),IF(RoundsRun=5,VLOOKUP(B27,SeriesSummary,Round5RankChange,FALSE),IF(RoundsRun=6,VLOOKUP(B27,SeriesSummary,Round6RankChange,FALSE),\"-\"))))),IF((IF(RoundsRun=2,VLOOKUP(B27,SeriesSummary,Round2RankChange,FALSE),IF(RoundsRun=3,VLOOKUP(B27,SeriesSummary,Round3RankChange,FALSE),IF(RoundsRun=4,VLOOKUP(B27,SeriesSummary,Round4RankChange,FALSE),IF(RoundsRun=5,VLOOKUP(B27,SeriesSummary,Round5RankChange,FALSE),IF(RoundsRun=6,VLOOKUP(B27,SeriesSummary,Round6RankChange,FALSE),\"-\"))))))=0,\"-\",(IF(RoundsRun=2,VLOOKUP(B27,SeriesSummary,Round2RankChange,FALSE),IF(RoundsRun=3,VLOOKUP(B27,SeriesSummary,Round3RankChange,FALSE),IF(RoundsRun=4,VLOOKUP(B27,SeriesSummary,Round4RankChange,FALSE),IF(RoundsRun=5,VLOOKUP(B27,SeriesSummary,Round5RankChange,FALSE),IF(RoundsRun=6,VLOOKUP(B27,SeriesSummary,Round6RankChange,FALSE),\"-\")))))))),\"-\")","v":"-"}]
[null,"Shawn G.","A",195.99,8,0,8,9,13,213.25,14,0,14,22,7,9,0,7,10,3,211.36,13,0,13,35,7,9,0,8,10,0,0,0,0,0,35,0,9,0,0,10,0,0,0,0,0,35,0,9,0,0,10,0,0,0,0,0,35,0,9,0,0,10,0,3,35,0,620.6,null,0,0,0,35,0,35,620.6,9,"-",10,"-"]
[null,"Stephen B.","A",204.95,13,0,13,7,8,216.5,17,0,17,30,4,5,2,4,5,3,203.8,10,0,10,40,9,6,-1,11,7,-2,0,0,0,0,40,0,6,0,0,7,0,0,0,0,0,40,0,6,0,0,7,0,0,0,0,0,40,0,6,0,0,7,0,3,40,0,625.25,null,0,0,0,40,0,40,625.25,7,-1,8,-2]
[null,"Susan Z.","B",0,0,0,0,0,0,0,0,0,0,0,0,0,0,0,0,0,0,0,0,0,0,0,0,0,0,0,0,0,0,0,0,0,0,0,0,0,0,0,0,0,0,0,0,0,0,0,0,0,0,0,0,0,0,0,0,0,0,0,0,0,0,0,0,0,null,0,0,0,0,0,0,0,0,"-",0,"-"]
[null,null,null,0,0,0,0,0,0,0,0,0,0,0,0,0,0,0,0,0,0,0,0,0,0,0,0,0,0,0,0,0,0,0,0,0,0,0,0,0,0,0,0,0,0,0,0,0,0,0,0,0,0,0,0,0,0,0,0,0,0,0,0,0,0,0,0,0,null,0,0,0,0,0,0,0,0,"-",0,"-"]
[null,null,null,0,0,0,{"$f":"SUM(E32:F32)","v":0},0,0,0,0,0,0,0,0,0,0,0,0,0,0,0,0,{"$f":"SUM(V32:W32)","v":0},0,0,0,0,0,0,0,0,0,0,{"$f":"SUM(AG32:AH32)","v":0},0,0,0,0,0,0,0,0,0,0,{"$f":"SUM(AR32:AS32)","v":0},0,0,0,0,0,0,0,0,0,0,{"$f":"SUM(BC32:BD32)","v":0},0,0,0,0,0,0,0,0,0,0,0,null,0,0,0,0,0,0,0,0,"-",0,"-"]
[null,null,null,0,0,0,0,0,0,0,0,0,0,0,0,0,0,0,0,0,0,0,0,0,0,0,0,0,0,0,0,0,0,0,0,0,0,0,0,0,0,0,0,0,0,0,0,0,0,0,0,0,0,0,0,0,0,0,0,0,0,0,0,0,0,0,0,0,null,0,0,0,0,0,0,0,0,"-",0,"-"]
[null,null,null,0,0,0,0,0,0,0,0,0,0,0,0,0,0,0,0,0,0,0,0,0,0,0,0,0,0,0,0,0,0,0,0,0,0,0,0,0,0,0,0,0,0,0,0,0,0,0,0,0,0,0,0,0,0,0,0,0,0,0,0,0,0,0,0,0,null,0,0,0,0,0,0,0,0,"-",0,"-"]
[null,null,null,0,0,0,0,0,0,0,0,0,0,0,0,0,0,0,0,0,0,0,0,0,0,0,0,0,0,0,0,0,0,0,0,0,0,0,0,0,0,0,0,0,0,0,0,0,0,0,0,0,0,0,0,0,0,0,0,0,0,0,0,0,0,0,0,0,null,0,0,0,0,0,0,0,0,"-",0,"-"]
[null,null,null,0,0,0,0,0,0,0,0,0,0,0,0,0,0,0,0,0,0,0,0,0,0,0,0,0,0,0,0,0,0,0,0,0,0,0,0,0,0,0,0,0,0,0,0,0,0,0,0,0,0,0,0,0,0,0,0,0,0,0,0,0,0,0,0,0,null,0,0,0,0,0,0,0,0,"-",0,"-"]
[null,null,null,0,0,0,0,0,0,0,0,0,0,0,0,0,0,0,0,0,0,0,0,0,0,0,0,0,0,0,0,0,0,0,0,0,0,0,0,0,0,0,0,0,0,0,0,0,0,0,0,0,0,0,0,0,0,0,0,0,0,0,0,0,0,0,0,0,null,0,0,0,0,0,0,0,0,"-",0,"-"]
[null,null,null,0,0,0,0,0,0,0,0,0,0,0,0,0,0,0,0,0,0,0,0,0,0,0,0,0,0,0,0,0,0,0,0,0,0,0,0,0,0,0,0,0,0,0,0,0,0,0,0,0,0,0,0,0,0,0,0,0,0,0,0,0,0,0,0,0,null,0,0,0,0,0,0,0,0,"-",0,"-"]
[]
[]
[null,"Series Name","2017 Group C / IMSA"]
[null,"Rounds Run",{"$f":"COUNT('Round 1'!B4,'Round 2'!B4,'Round 3'!B4,'Round 4'!B4,'Round 5'!B4,'Round 6'!B4)","v":3}]
[null,"Points Table"]
[null,"Position","Points"]
[null,1,20]
[null,2,19]
[null,3,18]
[null,4,17]
[null,5,16]
[null,6,15]
[null,7,14]
[null,8,13]
[null,9,12]
[null,10,11]
[null,11,10]
[null,12,9]
[null,13,8]
[null,14,7]
[null,15,6]
[null,16,5]
[null,17,4]
[null,18,3]
[null,19,2]
[null,20,1]